program: Orca
programVersion: 5.0.2
elementType: O O N C C C C C C C C C C C C C C C C C C H H H H H H H H H H H H H H H H H H H H H H H H H H H H H H H H H H H
charge: 0
multiplicity: 1
keywords: wb97x-d3
keywords: def2-TZVPP
keywords: def2/J RIJCOSX
keywords: DEFGRID2
keywords: scfconv7
keywords: smallprint printgap noloewdin
keywords: NOSOSCF
formula: C18H35NO2
InChI: InChI=1/C18H35NO2/c1-6-12-19(7-2)13-16-14-20-18(21-16)10-8-15(9-11-18)17(3,4)5/h15-16H,6-14H2,1-5H3
56 atoms
O  -0.38666 0.75963 -0.43754
O  -0.307923 2.684308 0.743672
N  -2.863335 -0.823465 0.32356
C  3.091935 0.179906 0.104835
C  0.482125 1.615765 0.285736
C  2.486563 0.929066 -1.087041
C  1.964217 -0.273397 1.038861
C  4.062183 -0.963721 -0.295821
C  1.59689 2.08702 -0.641496
C  1.080364 0.88776 1.479411
C  -1.69163 1.297806 -0.449896
C  -1.450546 2.755992 -0.069297
C  3.343322 -2.10917 -1.013263
C  5.160084 -0.419411 -1.216596
C  4.746486 -1.522277 0.956554
C  -2.624231 0.5836 0.53158
C  -3.466808 -1.163112 -0.947069
C  -1.791974 -1.719164 0.721191
C  -4.842288 -0.539338 -1.158554
C  -2.312561 -3.054897 1.232949
C  -5.825971 -0.871208 -0.046541
H  3.699935 0.909018 0.662334
H  3.274216 1.32905 -1.727296
H  1.900911 0.24357 -1.705821
H  1.343191 -1.020783 0.537746
H  2.371193 -0.755592 1.929263
H  1.171441 2.593831 -1.512392
H  2.197695 2.828651 -0.105971
H  1.668306 1.602815 2.063085
H  0.278096 0.53348 2.131845
H  -2.087006 1.216058 -1.467917
H  -2.267743 3.196744 0.506121
H  -1.286063 3.381166 -0.956765
H  4.059367 -2.876969 -1.313229
H  2.602597 -2.593594 -0.375928
H  2.834179 -1.772371 -1.917349
H  5.925605 -1.178126 -1.390771
H  5.655127 0.44954 -0.776431
H  4.776228 -0.124346 -2.193276
H  5.503845 -2.259644 0.683372
H  5.24664 -0.73296 1.522604
H  4.046306 -2.020019 1.627679
H  -3.586658 1.108315 0.505795
H  -2.24495 0.722044 1.549081
H  -2.8175 -0.918337 -1.804567
H  -3.589781 -2.248352 -0.977187
H  -1.06327 -1.889368 -0.084221
H  -1.233526 -1.238663 1.526489
H  -5.226239 -0.904188 -2.114853
H  -4.762729 0.545568 -1.27558
H  -3.002262 -2.905661 2.063276
H  -2.835803 -3.62388 0.46372
H  -1.485557 -3.675331 1.5808
H  -5.489279 -0.4857 0.914866
H  -5.940533 -1.950977 0.062822
H  -6.811693 -0.453332 -0.252268
totalener: -912.29382219 hartree
nucrepener: 1932.82253922 hartree
electener: -2845.11636141 hartree
oneelecener: -5078.68558540 hartree
twoeener: 2233.56922399 hartree
kineticenergy: 907.83169264 hartree
xcener: -92.078594865342 hartree
chargesum: 0.0000000
charge: -0.365686 -0.336891 -0.163209 0.099396 0.561108 -0.217288 -0.235331 0.230000 -0.264525 -0.292525 0.196083 -0.006284 -0.344874 -0.326180 -0.327355 -0.238072 -0.132010 -0.052176 -0.095779 -0.237897 -0.247331 0.050316 0.081416 0.082518 0.084442 0.082824 0.063997 0.077481 0.089474 0.074483 0.080515 0.075735 0.069891 0.089390 0.086574 0.093727 0.086171 0.093324 0.087785 0.086117 0.091603 0.088326 0.078157 0.110620 0.088033 0.092775 0.065789 0.061265 0.069608 0.052519 0.076401 0.068911 0.080468 0.078853 0.070932 0.086384
qa: -0.3657 -0.3369 -0.1632 0.0994 0.5611 -0.2173 -0.2353 0.2300 -0.2645 -0.2925 0.1961 -0.0063 -0.3449 -0.3262 -0.3274 -0.2381 -0.1320 -0.0522 -0.0958 -0.2379 -0.2473 0.0503 0.0814 0.0825 0.0844 0.0828 0.0640 0.0775 0.0895 0.0745 0.0805 0.0757 0.0699 0.0894 0.0866 0.0937 0.0862 0.0933 0.0878 0.0861 0.0916 0.0883 0.0782 0.1106 0.0880 0.0928 0.0658 0.0613 0.0696 0.0525 0.0764 0.0689 0.0805 0.0789 0.0709 0.0864
va: 2.0243 2.0633 2.8460 3.6821 3.8292 3.9242 3.9466 3.7376 4.0749 4.0093 3.7659 4.0474 3.9545 3.9296 3.9295 4.0663 3.9505 3.9612 3.8588 3.9141 3.9442 1.0178 1.0126 1.0232 1.0037 1.0163 1.0205 1.0218 1.0228 1.0258 0.9985 0.9953 0.9927 1.0081 1.0043 1.0046 1.0115 1.0043 1.0010 1.0100 1.0054 1.0035 0.9977 1.0019 1.0018 0.9924 0.9970 0.9983 1.0117 1.0054 1.0149 1.0086 1.0115 1.0125 1.0052 1.0059
dispcorr: -0.030625172 hartree
energy: -912.324447360748
dipole: 2.64911 -2.70677 -0.05766 -14.09230 14.19178 0.09949 -1.61343 1.28873 -0.32470
magnitude: 0.34446 au
magnitude: 0.87555 debye
