program: Orca
programVersion: 5.0.2
elementType: O O N C C C C C C C C C C C C C C C C C C H H H H H H H H H H H H H H H H H H H H H H H H H H H H H H H H H H H
charge: 0
multiplicity: 1
keywords: wb97x-d3
keywords: def2-TZVPP
keywords: def2/J RIJCOSX
keywords: DEFGRID2
keywords: scfconv7
keywords: smallprint printgap noloewdin
keywords: NOSOSCF
formula: C18H35NO2
InChI: InChI=1/C18H35NO2/c1-6-12-19(7-2)13-16-14-20-18(21-16)10-8-15(9-11-18)17(3,4)5/h15-16H,6-14H2,1-5H3
56 atoms
O  -0.384791 0.669917 0.38348
O  -0.152537 2.903293 0.417257
N  -3.017255 -0.864434 -0.220363
C  3.155967 0.220811 0.07965
C  0.573912 1.695434 0.321688
C  2.186792 0.373463 -1.097008
C  2.365321 0.278163 1.391008
C  4.092441 -1.010872 -0.041077
C  1.35303 1.645557 -0.990757
C  1.522309 1.546597 1.497395
C  -1.571792 1.163987 -0.195055
C  -1.516084 2.642155 0.199773
C  5.01874 -1.085356 1.177588
C  3.310892 -2.322696 -0.145335
C  4.978409 -0.863583 -1.28308
C  -2.794597 0.44738 0.342491
C  -4.396057 -1.299646 -0.081746
C  -2.045469 -1.879817 0.152356
C  -5.328306 -0.665696 -1.110374
C  -1.960258 -2.226064 1.63712
C  -4.917755 -0.964352 -2.543644
H  3.816239 1.1018 0.06976
H  2.727819 0.389771 -2.044654
H  1.51502 -0.488342 -1.139314
H  1.714777 -0.596819 1.478515
H  3.040394 0.24753 2.247634
H  0.670393 1.722498 -1.842205
H  2.002888 2.524623 -1.038521
H  2.176871 2.42284 1.520607
H  0.949897 1.552021 2.4279
H  -1.554987 1.048645 -1.288352
H  -2.090069 2.829567 1.116537
H  -1.915013 3.290738 -0.585062
H  5.537268 -0.137762 1.342697
H  4.484442 -1.336154 2.094253
H  5.78084 -1.85375 1.033216
H  2.647459 -2.47429 0.707598
H  3.996918 -3.171727 -0.17424
H  2.704549 -2.370291 -1.050676
H  5.703348 -1.678212 -1.336102
H  4.405967 -0.886455 -2.210502
H  5.53977 0.07336 -1.260845
H  -3.654397 1.070079 0.078647
H  -2.748372 0.45416 1.444708
H  -4.421671 -2.383178 -0.227942
H  -4.793665 -1.123455 0.930751
H  -2.295512 -2.7812 -0.4132
H  -1.060234 -1.574895 -0.199684
H  -5.385876 0.41645 -0.959821
H  -6.338847 -1.039094 -0.923194
H  -2.921601 -2.550928 2.038825
H  -1.250923 -3.040284 1.790774
H  -1.612193 -1.381497 2.231807
H  -5.593688 -0.49434 -3.258214
H  -4.927542 -2.038278 -2.739522
H  -3.908909 -0.605507 -2.74181
totalener: -912.29551835 hartree
nucrepener: 1916.43640399 hartree
electener: -2828.73192234 hartree
oneelecener: -5045.88253660 hartree
twoeener: 2217.15061426 hartree
kineticenergy: 907.83590266 hartree
xcener: -92.076493903640 hartree
chargesum: 0.0000000
charge: -0.352628 -0.344548 -0.179073 0.084314 0.540677 -0.227080 -0.217101 0.224706 -0.272854 -0.233836 0.143759 0.032137 -0.327469 -0.341522 -0.323824 -0.189961 -0.112446 -0.024355 -0.089937 -0.272434 -0.248075 0.049378 0.083430 0.078554 0.082057 0.079906 0.072594 0.082662 0.079203 0.069076 0.060391 0.057972 0.069054 0.093531 0.088061 0.085959 0.090834 0.090248 0.087828 0.086212 0.087242 0.091384 0.095554 0.082152 0.079814 0.079610 0.066740 0.066131 0.048838 0.066168 0.083761 0.084673 0.080517 0.083711 0.068273 0.080036
qa: -0.3526 -0.3445 -0.1791 0.0843 0.5407 -0.2271 -0.2171 0.2247 -0.2729 -0.2338 0.1438 0.0321 -0.3275 -0.3415 -0.3238 -0.1900 -0.1124 -0.0244 -0.0899 -0.2724 -0.2481 0.0494 0.0834 0.0786 0.0821 0.0799 0.0726 0.0827 0.0792 0.0691 0.0604 0.0580 0.0691 0.0935 0.0881 0.0860 0.0908 0.0902 0.0878 0.0862 0.0872 0.0914 0.0956 0.0822 0.0798 0.0796 0.0667 0.0661 0.0488 0.0662 0.0838 0.0847 0.0805 0.0837 0.0683 0.0800
va: 2.0319 2.0627 2.8645 3.6965 3.8285 3.9542 3.9404 3.7441 4.0478 4.0211 3.9014 4.0066 3.9314 3.9550 3.9290 4.0203 3.9375 3.9465 3.8772 3.8981 3.9213 1.0180 1.0160 1.0111 1.0096 1.0139 1.0152 1.0235 1.0201 1.0342 1.0099 0.9912 0.9911 1.0043 1.0008 1.0113 1.0049 1.0080 1.0026 1.0099 1.0048 1.0055 0.9981 1.0115 0.9946 1.0019 0.9998 1.0172 1.0129 1.0144 1.0034 1.0131 1.0081 1.0067 1.0053 1.0229
dispcorr: -0.029567530 hartree
energy: -912.325085877635
dipole: 2.68195 -2.93402 -0.25207 -14.16049 13.97601 -0.18448 -2.53031 2.48281 -0.04750
magnitude: 0.31596 au
magnitude: 0.80309 debye
