program: Orca
programVersion: 5.0.2
elementType: O O N C C C C C C C C C C C C C C C C C C H H H H H H H H H H H H H H H H H H H H H H H H H H H H H H H H H H H
charge: 0
multiplicity: 1
keywords: wb97x-d3
keywords: def2-TZVPP
keywords: def2/J RIJCOSX
keywords: DEFGRID2
keywords: scfconv7
keywords: smallprint printgap noloewdin
keywords: NOSOSCF
formula: C18H35NO2
InChI: InChI=1/C18H35NO2/c1-6-12-19(7-2)13-16-14-20-18(21-16)10-8-15(9-11-18)17(3,4)5/h15-16H,6-14H2,1-5H3
56 atoms
O  -0.062071 0.440659 -0.679093
O  -0.28681 2.50675 0.174077
N  -3.50203 -0.32939 0.402457
C  3.394115 0.351165 0.252204
C  0.63977 1.47205 -0.006241
C  2.837244 0.865241 -1.079601
C  2.232436 -0.131692 1.12679
C  4.53876 -0.685474 0.09735
C  1.783179 1.951176 -0.881881
C  1.184044 0.958021 1.327431
C  -1.450192 0.638368 -0.518097
C  -1.545806 1.902722 0.340193
C  4.069367 -1.975075 -0.580544
C  5.678179 -0.08152 -0.731073
C  5.109753 -1.033522 1.476484
C  -2.098845 -0.572371 0.136102
C  -4.362559 -0.466254 -0.757102
C  -4.007123 -1.002628 1.585265
C  -4.579114 -1.881082 -1.299648
C  -3.541699 -0.350781 2.877734
C  -5.503551 -1.878394 -2.5089
H  3.842114 1.216015 0.765932
H  3.637342 1.275982 -1.697303
H  2.399681 0.040008 -1.648162
H  1.756328 -1.004618 0.671685
H  2.592757 -0.449721 2.106489
H  1.385018 2.280247 -1.844474
H  2.239487 2.825589 -0.407768
H  1.626913 1.802557 1.864773
H  0.370431 0.583294 1.956303
H  -1.889488 0.813905 -1.508243
H  -1.752221 1.655379 1.390158
H  -2.319007 2.593842 0.006248
H  3.293263 -2.482696 -0.006251
H  3.676107 -1.794427 -1.581914
H  4.902166 -2.674077 -0.683075
H  6.004689 0.876841 -0.320394
H  5.398088 0.081485 -1.771973
H  6.543326 -0.747409 -0.735282
H  5.986424 -1.676717 1.377172
H  5.421544 -0.135969 2.015783
H  4.394268 -1.56631 2.103043
H  -1.583317 -0.750949 1.082736
H  -1.920909 -1.470089 -0.474378
H  -5.336187 -0.032986 -0.503771
H  -3.967758 0.161995 -1.561662
H  -5.098622 -0.953513 1.551548
H  -3.754273 -2.074454 1.602627
H  -5.001778 -2.519267 -0.518341
H  -3.62171 -2.331688 -1.575533
H  -3.837145 0.697854 2.905884
H  -3.98261 -0.854621 3.73842
H  -2.458714 -0.396417 3.001491
H  -5.09172 -1.279503 -3.323463
H  -6.482254 -1.463212 -2.260701
H  -5.663163 -2.886126 -2.892191
totalener: -912.29533172 hartree
nucrepener: 1880.87543358 hartree
electener: -2793.17076530 hartree
oneelecener: -4974.74838489 hartree
twoeener: 2181.57761959 hartree
kineticenergy: 907.82912046 hartree
xcener: -92.075519795378 hartree
chargesum: -0.0000000
charge: -0.380344 -0.332491 -0.184985 0.083546 0.566430 -0.210759 -0.221609 0.226237 -0.262665 -0.303877 0.235755 0.007409 -0.338829 -0.326894 -0.326599 -0.223619 -0.106616 -0.052307 -0.076438 -0.256990 -0.258753 0.047399 0.082257 0.084563 0.082762 0.081826 0.069694 0.079313 0.084147 0.064505 0.064574 0.059356 0.081574 0.087231 0.091185 0.088753 0.092854 0.087674 0.085973 0.086143 0.092737 0.086260 0.087886 0.092493 0.079176 0.073776 0.069777 0.066789 0.059156 0.058971 0.081868 0.088394 0.067969 0.076002 0.073708 0.087654
qa: -0.3803 -0.3325 -0.1850 0.0835 0.5664 -0.2108 -0.2216 0.2262 -0.2627 -0.3039 0.2358 0.0074 -0.3388 -0.3269 -0.3266 -0.2236 -0.1066 -0.0523 -0.0764 -0.2570 -0.2588 0.0474 0.0823 0.0846 0.0828 0.0818 0.0697 0.0793 0.0841 0.0645 0.0646 0.0594 0.0816 0.0872 0.0912 0.0888 0.0929 0.0877 0.0860 0.0861 0.0927 0.0863 0.0879 0.0925 0.0792 0.0738 0.0698 0.0668 0.0592 0.0590 0.0819 0.0884 0.0680 0.0760 0.0737 0.0877
va: 2.0380 2.0747 2.8412 3.7074 3.8233 3.9053 3.9303 3.7387 4.0593 4.0466 3.8235 4.0162 3.9534 3.9306 3.9304 4.0254 4.0065 3.9065 3.8271 3.9360 3.9648 1.0186 1.0131 1.0215 1.0182 1.0139 1.0337 1.0177 1.0237 1.0178 0.9997 1.0041 0.9971 1.0046 1.0048 1.0070 1.0047 1.0025 1.0108 1.0104 1.0051 1.0038 0.9999 1.0176 1.0014 1.0022 0.9922 0.9936 1.0085 1.0135 1.0111 1.0141 1.0043 1.0036 1.0040 1.0043
dispcorr: -0.028656169 hartree
energy: -912.323987888214
dipole: 1.61524 -2.10895 -0.49372 -12.56123 12.05866 -0.50257 1.46398 -1.28742 0.17656
magnitude: 0.72630 au
magnitude: 1.84610 debye
