program: Orca
programVersion: 5.0.2
elementType: O O N C C C C C C C C C C C C C C C C C C H H H H H H H H H H H H H H H H H H H H H H H H H H H H H H H H H H H
charge: 0
multiplicity: 1
keywords: wb97x-d3
keywords: def2-TZVPP
keywords: def2/J RIJCOSX
keywords: DEFGRID2
keywords: scfconv7
keywords: smallprint printgap noloewdin
keywords: NOSOSCF
formula: C18H35NO2
InChI: InChI=1/C18H35NO2/c1-6-12-19(7-2)13-16-14-20-18(21-16)10-8-15(9-11-18)17(3,4)5/h15-16H,6-14H2,1-5H3
56 atoms
O  0.035958 0.425209 -0.739308
O  -0.234174 2.263555 0.521674
N  -3.388265 -0.607852 0.165942
C  3.488563 0.208188 0.19645
C  0.712296 1.303844 0.14164
C  2.936106 0.986224 -1.00264
C  2.326935 -0.472522 0.927723
C  4.656053 -0.751061 -0.158231
C  1.853508 1.980866 -0.595828
C  1.255898 0.530568 1.342965
C  -1.356569 0.545434 -0.54113
C  -1.488023 1.629023 0.534365
C  4.227592 -1.854655 -1.128286
C  5.803811 0.042147 -0.79307
C  5.197929 -1.40136 1.119265
C  -1.975409 -0.778641 -0.11336
C  -4.210436 -0.651453 -1.028516
C  -3.874675 -1.420247 1.264613
C  -5.612524 -0.087939 -0.829486
C  -3.910633 -2.929333 1.030819
C  -5.619695 1.332561 -0.284651
H  3.912142 0.949804 0.891266
H  3.733488 1.535871 -1.505413
H  2.523077 0.294116 -1.741508
H  1.874468 -1.233784 0.286126
H  2.683119 -0.988778 1.82061
H  1.457811 2.498175 -1.472792
H  2.280583 2.744922 0.060871
H  1.677913 1.25004 2.051523
H  0.444312 0.017627 1.867827
H  -1.808779 0.882893 -1.481604
H  -1.721118 1.191251 1.514551
H  -2.261682 2.363216 0.310708
H  5.072506 -2.507328 -1.357673
H  3.439209 -2.483894 -0.713106
H  3.866138 -1.451499 -2.075077
H  6.108707 0.879276 -0.16043
H  5.541381 0.443365 -1.772177
H  6.67851 -0.595732 -0.934587
H  6.097912 -1.980685 0.903759
H  5.463515 -0.649324 1.865999
H  4.481984 -2.084985 1.576041
H  -1.471518 -1.105516 0.801141
H  -1.77346 -1.553234 -0.868581
H  -3.716645 -0.051583 -1.797616
H  -4.282774 -1.667598 -1.449947
H  -3.246989 -1.206674 2.133817
H  -4.873985 -1.073699 1.539402
H  -6.200131 -0.740443 -0.177704
H  -6.117801 -0.116773 -1.798384
H  -4.59059 -3.204766 0.224045
H  -2.924142 -3.324567 0.783231
H  -4.252108 -3.442598 1.930405
H  -5.064534 2.00664 -0.939782
H  -5.157262 1.385126 0.700182
H  -6.635563 1.718795 -0.201402
totalener: -912.29546719 hartree
nucrepener: 1884.82856167 hartree
electener: -2797.12402887 hartree
oneelecener: -4982.66353494 hartree
twoeener: 2185.53950607 hartree
kineticenergy: 907.83439622 hartree
xcener: -92.077446468272 hartree
chargesum: 0.0000000
charge: -0.379807 -0.333183 -0.173153 0.079725 0.571430 -0.210549 -0.216722 0.229469 -0.260739 -0.310889 0.236367 0.004922 -0.340623 -0.326816 -0.328015 -0.225238 -0.127510 -0.066247 -0.099552 -0.251301 -0.254262 0.047302 0.081073 0.083920 0.082603 0.082006 0.070028 0.079513 0.082811 0.068748 0.063305 0.057825 0.076751 0.088381 0.088695 0.091150 0.092898 0.087928 0.085884 0.085953 0.092795 0.086769 0.086616 0.087798 0.087646 0.083287 0.067972 0.074856 0.058987 0.069364 0.077964 0.082089 0.088831 0.070665 0.078604 0.091672
qa: -0.3798 -0.3332 -0.1732 0.0797 0.5714 -0.2105 -0.2167 0.2295 -0.2607 -0.3109 0.2364 0.0049 -0.3406 -0.3268 -0.3280 -0.2252 -0.1275 -0.0662 -0.0996 -0.2513 -0.2543 0.0473 0.0811 0.0839 0.0826 0.0820 0.0700 0.0795 0.0828 0.0687 0.0633 0.0578 0.0768 0.0884 0.0887 0.0911 0.0929 0.0879 0.0859 0.0860 0.0928 0.0868 0.0866 0.0878 0.0876 0.0833 0.0680 0.0749 0.0590 0.0694 0.0780 0.0821 0.0888 0.0707 0.0786 0.0917
va: 2.0425 2.0738 2.8022 3.7126 3.8162 3.9097 3.9249 3.7342 4.0552 4.0412 3.8528 4.0054 3.9538 3.9301 3.9310 4.0283 3.9511 3.9675 3.8672 3.9131 3.9440 1.0184 1.0137 1.0212 1.0191 1.0136 1.0338 1.0185 1.0239 1.0169 1.0050 1.0056 0.9974 1.0072 1.0043 1.0045 1.0048 1.0032 1.0106 1.0109 1.0049 1.0028 0.9938 1.0096 0.9974 1.0055 0.9999 0.9943 1.0036 1.0126 1.0022 1.0026 1.0128 1.0032 1.0092 1.0089
dispcorr: -0.029261021 hartree
energy: -912.324728215084
dipole: 0.74244 -1.20612 -0.46369 -10.74736 10.22430 -0.52306 0.68870 -0.55999 0.12871
magnitude: 0.71075 au
magnitude: 1.80657 debye
