program: Orca
programVersion: 4.2.1
elementType: Si F O N N N C C C C C C C C C C C C C C H H H H H H H H H H H H H H H H H H H H
charge: 0
multiplicity: 1
keywords: wb97x-d3
keywords: def2-TZVPP
keywords: def2/J RIJCOSX GRIDX6 NOFINALGRIDX
keywords: grid4 nofinalgrid
keywords: scfconv7
keywords: smallprint printgap noloewdin
keywords: NOSOSCF
formula: C14H20FN3OSi
InChI: InChI=1/C14H20FN3OSi/c1-20(2,3)9-14(19,8-18-11-16-10-17-18)12-4-6-13(15)7-5-12/h4-7,10-11,19H,8-9H2,1-3H3
40 atoms
Si -2.459771 0.334335 -0.177035
F  0.892194 -5.268592 0.131696
O  0.212721 0.737651 1.603321
N  1.808091 2.349394 -0.321606
N  1.454114 3.142623 0.696039
N  1.812674 4.359966 -1.14862
C  -0.681304 0.820003 -0.643326
C  0.454793 0.34749 0.270502
C  1.820404 0.910567 -0.190751
C  -2.712102 -1.528048 -0.052877
C  -3.526404 0.995054 -1.586443
C  -3.009719 1.160299 1.424364
C  0.581496 -1.166693 0.251904
C  0.557674 -1.916849 1.42308
C  0.730103 -1.83951 -0.959903
C  0.659318 -3.301537 1.390953
C  0.83801 -3.219653 -1.012485
C  2.00508 3.087604 -1.410827
C  0.795329 -3.928903 0.17131
C  1.471326 4.333518 0.150389
H  -0.682292 1.916297 -0.693087
H  -0.501458 0.494764 -1.672637
H  2.093039 0.510436 -1.165223
H  2.597788 0.619498 0.517295
H  -3.775305 -1.756191 0.056352
H  -2.194208 -1.963671 0.802168
H  -2.357874 -2.044513 -0.946771
H  -3.393704 2.071006 -1.719844
H  -4.588063 0.819142 -1.400346
H  -3.279042 0.516958 -2.536787
H  -2.513217 0.738172 2.297692
H  -4.085985 1.04023 1.567496
H  -2.802196 2.232468 1.413729
H  0.279403 1.702528 1.648593
H  0.44598 -1.433538 2.382224
H  0.757653 -1.292833 -1.894243
H  0.629603 -3.879148 2.305583
H  0.95152 -3.73189 -1.958741
H  2.292609 2.664492 -2.360061
H  1.230201 5.218434 0.717764
elementType: Si F O N C H
totalener: -1174.48831709 hartree
nucrepener: 1755.09032733 hartree
electener: -2929.57864442 hartree
oneelecener: -5094.60355786 hartree
twoeener: 2165.02491344 hartree
cpcmener: -0.02782066 hartree
kineticenergy: 1170.05322807 hartree
xcener: -100.445636589000 hartree
chargesum: -0.0000000
charge: 0.475987 -0.227577 -0.432668 0.106326 -0.387085 -0.414114 -0.379161 0.556054 -0.146365 -0.437971 -0.443974 -0.426700 0.011396 -0.255614 -0.231188 -0.187249 -0.207982 0.081893 0.293668 0.085906 0.103229 0.107812 0.122896 0.136398 0.117109 0.106623 0.104712 0.101221 0.100469 0.102061 0.097397 0.107173 0.101405 0.222263 0.142401 0.141618 0.153839 0.154278 0.178341 0.165176
qa: 0.4760 -0.2276 -0.4327 0.1063 -0.3871 -0.4141 -0.3792 0.5561 -0.1464 -0.4380 -0.4440 -0.4267 0.0114 -0.2556 -0.2312 -0.1872 -0.2080 0.0819 0.2937 0.0859 0.1032 0.1078 0.1229 0.1364 0.1171 0.1066 0.1047 0.1012 0.1005 0.1021 0.0974 0.1072 0.1014 0.2223 0.1424 0.1416 0.1538 0.1543 0.1783 0.1652
va: 4.1037 1.0482 1.9925 3.3362 2.8450 3.0220 3.8990 3.6051 3.9151 3.9039 3.9089 3.8817 3.3623 3.9763 3.9416 3.8850 3.9150 4.0395 3.9066 4.0149 1.0093 1.0153 0.9984 1.0067 1.0086 1.0073 1.0076 1.0082 1.0098 1.0080 1.0179 1.0091 1.0085 1.0522 1.0353 1.0049 0.9976 0.9968 0.9914 0.9933
dispcorr: -0.021643158 hartree
energy: -1174.509960249141
dipole: -18.57179 18.83744 0.26565 9.06185 -9.28502 -0.22317 -2.59123 1.50489 -1.08633
magnitude: 1.14039 au
magnitude: 2.89864 debye
