program: Orca
programVersion: 4.2.1
elementType: Si F O N N N C C C C C C C C C C C C C C H H H H H H H H H H H H H H H H H H H H
charge: 0
multiplicity: 1
keywords: wb97x-d3
keywords: def2-TZVPP
keywords: def2/J RIJCOSX GRIDX6 NOFINALGRIDX
keywords: grid4 nofinalgrid
keywords: scfconv7
keywords: smallprint printgap noloewdin
keywords: NOSOSCF
formula: C14H20FN3OSi
InChI: InChI=1/C14H20FN3OSi/c1-20(2,3)9-14(19,8-18-11-16-10-17-18)12-4-6-13(15)7-5-12/h4-7,10-11,19H,8-9H2,1-3H3
40 atoms
Si -3.131065 -0.000723 0.256518
F  1.818633 -4.203894 -0.541208
O  -0.327719 1.34267 1.263407
N  1.843916 2.075009 -0.38795
N  2.134588 2.989961 0.538781
N  3.921953 1.709713 0.121231
C  -1.796226 1.023858 -0.633192
C  -0.364156 0.97104 -0.090859
C  0.50763 1.946963 -0.914356
C  -3.345285 0.513648 2.055456
C  -2.804115 -1.85303 0.168763
C  -4.733241 0.371009 -0.667793
C  0.22503 -0.424711 -0.190053
C  0.795947 -1.060551 0.907041
C  0.224947 -1.093265 -1.412958
C  1.335233 -2.336141 0.79702
C  0.758937 -2.364515 -1.543486
C  2.915914 1.314225 -0.621876
C  1.303977 -2.968122 -0.427317
C  3.38787 2.735224 0.812626
H  -2.134105 2.068863 -0.620139
H  -1.813556 0.743727 -1.691128
H  0.060364 2.941702 -0.911179
H  0.568652 1.624929 -1.953331
H  -2.491611 0.229836 2.671645
H  -4.22987 0.034612 2.48301
H  -3.483846 1.592134 2.159767
H  -3.653599 -2.402664 0.583436
H  -1.918525 -2.151848 0.73149
H  -2.669964 -2.195867 -0.858992
H  -4.979574 1.435173 -0.64153
H  -5.578263 -0.165949 -0.230135
H  -4.674094 0.077934 -1.718623
H  -0.728772 2.21306 1.360644
H  0.825352 -0.574675 1.871283
H  -0.201729 -0.630316 -2.294155
H  1.774342 -2.824698 1.657294
H  0.747797 -2.875265 -2.497559
H  2.921649 0.506981 -1.33765
H  3.941949 3.315578 1.534349
elementType: Si F O N C H
totalener: -1174.49578013 hartree
nucrepener: 1770.85765270 hartree
electener: -2945.35343283 hartree
oneelecener: -5126.21373109 hartree
twoeener: 2180.86029826 hartree
cpcmener: -0.02901181 hartree
kineticenergy: 1170.04008347 hartree
xcener: -100.439603320483 hartree
chargesum: 0.0000000
charge: 0.460944 -0.224944 -0.382152 0.147940 -0.353929 -0.412255 -0.354924 0.527794 -0.172187 -0.423948 -0.420168 -0.442172 -0.061790 -0.193585 -0.220543 -0.193291 -0.190419 0.049547 0.299126 0.056969 0.107105 0.098339 0.124866 0.136964 0.100358 0.105168 0.103271 0.115038 0.102843 0.101768 0.101227 0.100251 0.101035 0.202510 0.135812 0.133991 0.151075 0.151946 0.170040 0.160384
qa: 0.4609 -0.2249 -0.3822 0.1479 -0.3539 -0.4123 -0.3549 0.5278 -0.1722 -0.4239 -0.4202 -0.4422 -0.0618 -0.1936 -0.2205 -0.1933 -0.1904 0.0495 0.2991 0.0570 0.1071 0.0983 0.1249 0.1370 0.1004 0.1052 0.1033 0.1150 0.1028 0.1018 0.1012 0.1003 0.1010 0.2025 0.1358 0.1340 0.1511 0.1519 0.1700 0.1604
va: 4.1106 1.0523 2.0435 3.3337 2.8926 3.0299 3.9094 3.6876 3.9082 3.8876 3.8989 3.9098 3.3948 3.8940 3.8925 3.9021 3.9061 4.0759 3.9128 4.0520 1.0088 1.0138 1.0147 0.9955 1.0159 1.0096 1.0072 1.0092 1.0095 1.0082 1.0086 1.0096 1.0087 1.0281 1.0376 1.0121 0.9979 0.9963 0.9942 0.9952
dispcorr: -0.022353976 hartree
energy: -1174.518134105895
dipole: -27.77675 25.72409 -2.05266 6.68692 -6.14821 0.53872 0.78121 -2.10765 -1.32644
magnitude: 2.50261 au
magnitude: 6.36113 debye
