program: Orca
programVersion: 4.2.1
elementType: Cl O N N C C C C C C C C C C C C C C C C H H H H H H H H H H H H H H H H H
charge: 0
multiplicity: 1
keywords: wb97x-d3
keywords: def2-TZVPP
keywords: def2/J RIJCOSX GRIDX6 NOFINALGRIDX
keywords: grid4 nofinalgrid
keywords: scfconv7
keywords: smallprint printgap noloewdin
keywords: NOSOSCF
formula: C16H17ClN2O
InChI: InChI=1/C16H17ClN2O/c1-16(13-4-3-9-18-11-13)10-15(20-19(16)2)12-5-7-14(17)8-6-12/h3-9,11,15H,10H2,1-2H3
37 atoms
Cl -4.961317 -2.104609 -0.933639
O  1.732089 -1.586764 -0.355061
N  1.912026 -0.213423 -0.688419
N  2.361463 4.219368 0.866535
C  2.146966 0.438956 0.612878
C  1.073683 -0.267919 1.469111
C  0.810956 -1.586601 0.710042
C  1.837281 1.913379 0.440972
C  3.536072 0.177549 1.194451
C  -0.622815 -1.719651 0.255796
C  2.985546 -0.148299 -1.648693
C  0.704434 2.314225 -0.266248
C  2.626298 2.920848 0.982233
C  -1.028151 -1.436043 -1.04357
C  -1.581638 -2.128655 1.178595
C  0.421025 3.660726 -0.396161
C  -2.36127 -1.550356 -1.413199
C  -2.916397 -2.247942 0.825875
C  1.281513 4.578143 0.189593
C  -3.295691 -1.955721 -0.474909
H  1.433503 -0.445308 2.482129
H  0.164841 0.327125 1.550709
H  1.061807 -2.449609 1.332055
H  4.332771 0.651676 0.619994
H  3.741967 -0.893073 1.229879
H  3.603489 0.547081 2.217636
H  3.91468 -0.629193 -1.324375
H  3.194043 0.900437 -1.860163
H  2.666438 -0.6103 -2.583151
H  0.051218 1.575356 -0.712657
H  3.521388 2.681461 1.543828
H  -0.31032 -1.113778 -1.785165
H  -1.288375 -2.365299 2.195147
H  -0.451007 3.997375 -0.940419
H  -2.662886 -1.32452 -2.427339
H  -3.646847 -2.570863 1.555498
H  1.088039 5.64212 0.109021
elementType: Cl O N C H
totalener: -1264.89106209 hartree
nucrepener: 1640.57619321 hartree
electener: -2905.46725530 hartree
oneelecener: -4986.39931751 hartree
twoeener: 2080.93206221 hartree
cpcmener: -0.01985151 hartree
kineticenergy: 1260.64874325 hartree
xcener: -100.548634052786 hartree
chargesum: 0.0000000
charge: -0.103822 -0.337061 -0.101855 -0.368133 0.517217 -0.201634 0.276635 -0.224721 -0.380898 0.002231 -0.205413 -0.129336 -0.015270 -0.235974 -0.262851 -0.189443 -0.143484 -0.128367 0.024710 0.086199 0.095199 0.110924 0.120460 0.111478 0.112794 0.106954 0.093994 0.112427 0.110979 0.154507 0.119206 0.150371 0.138380 0.154015 0.141671 0.141995 0.145914
qa: -0.1038 -0.3371 -0.1019 -0.3681 0.5172 -0.2016 0.2766 -0.2247 -0.3809 0.0022 -0.2054 -0.1293 -0.0153 -0.2360 -0.2629 -0.1894 -0.1435 -0.1284 0.0247 0.0862 0.0952 0.1109 0.1205 0.1115 0.1128 0.1070 0.0940 0.1124 0.1110 0.1545 0.1192 0.1504 0.1384 0.1540 0.1417 0.1420 0.1459
va: 1.2015 1.9022 2.6968 3.0773 3.4482 3.9459 3.8052 3.6730 3.9582 3.5555 3.9612 3.9262 4.0889 3.9645 4.0544 3.9479 4.0107 3.9581 3.9778 3.8295 1.0141 0.9943 0.9959 0.9913 1.0122 1.0003 0.9994 0.9912 0.9949 1.0130 1.0122 1.0175 1.0062 0.9942 1.0067 1.0056 0.9979
dispcorr: -0.019228518 hartree
energy: -1264.910290607853
dipole: 25.87456 -25.33203 0.54253 6.72232 -7.04881 -0.32649 4.33598 -3.87957 0.45641
magnitude: 0.78054 au
magnitude: 1.98398 debye
