program: Orca
programVersion: 4.2.1
elementType: Cl O N N C C C C C C C C C C C C C C C C H H H H H H H H H H H H H H H H H
charge: 0
multiplicity: 1
keywords: wb97x-d3
keywords: def2-TZVPP
keywords: def2/J RIJCOSX GRIDX6 NOFINALGRIDX
keywords: grid4 nofinalgrid
keywords: scfconv7
keywords: smallprint printgap noloewdin
keywords: NOSOSCF
formula: C16H17ClN2O
InChI: InChI=1/C16H17ClN2O/c1-16(13-4-3-9-18-11-13)10-15(20-19(16)2)12-5-7-14(17)8-6-12/h3-9,11,15H,10H2,1-2H3
37 atoms
Cl -4.879886 -1.827391 -0.990585
O  1.832492 -1.673575 -0.369285
N  1.951751 -0.289583 -0.683685
N  2.080026 4.144837 0.886655
C  2.197513 0.360172 0.619076
C  1.256295 -0.46099 1.536133
C  0.907765 -1.701392 0.688124
C  1.738876 1.799963 0.485755
C  3.638583 0.230937 1.111536
C  -0.531165 -1.720319 0.224903
C  2.985271 -0.163416 -1.680124
C  0.527418 2.095125 -0.137992
C  2.468458 2.875967 0.976519
C  -0.898602 -1.556476 -1.105025
C  -1.53256 -1.927897 1.170712
C  0.114236 3.41049 -0.239075
C  -2.234678 -1.584271 -1.483142
C  -2.869387 -1.963468 0.810058
C  0.927079 4.403202 0.288803
C  -3.210106 -1.787611 -0.522471
H  1.773501 -0.744386 2.452501
H  0.367308 0.095418 1.828887
H  1.104555 -2.621364 1.244435
H  4.349264 0.784081 0.49639
H  3.944315 -0.816069 1.118866
H  3.732585 0.595904 2.134452
H  3.945367 -0.610116 -1.399426
H  3.142683 0.89641 -1.879464
H  2.650829 -0.622668 -2.61067
H  -0.085358 1.300052 -0.543442
H  3.418234 2.719568 1.47374
H  -0.149556 -1.39869 -1.868183
H  -1.271647 -2.069941 2.213493
H  -0.820458 3.667202 -0.71911
H  -2.505278 -1.44927 -2.521941
H  -3.631913 -2.129836 1.559147
H  0.633764 5.445303 0.226113
elementType: Cl O N C H
totalener: -1264.89066753 hartree
nucrepener: 1652.87580063 hartree
electener: -2917.76646816 hartree
oneelecener: -5011.01805526 hartree
twoeener: 2093.25158710 hartree
cpcmener: -0.01974080 hartree
kineticenergy: 1260.64581949 hartree
xcener: -100.548582678856 hartree
chargesum: -0.0000000
charge: -0.104409 -0.335606 -0.089690 -0.367602 0.480434 -0.175078 0.284072 -0.207870 -0.381642 -0.018850 -0.204024 -0.138213 -0.018922 -0.232365 -0.267212 -0.186789 -0.130303 -0.132015 0.022582 0.082565 0.094497 0.113475 0.118898 0.110249 0.111475 0.109870 0.093467 0.113141 0.110237 0.153403 0.120756 0.145383 0.141370 0.153785 0.141999 0.142838 0.146091
qa: -0.1044 -0.3356 -0.0897 -0.3676 0.4804 -0.1751 0.2841 -0.2079 -0.3816 -0.0188 -0.2040 -0.1382 -0.0189 -0.2324 -0.2672 -0.1868 -0.1303 -0.1320 0.0226 0.0826 0.0945 0.1135 0.1189 0.1102 0.1115 0.1099 0.0935 0.1131 0.1102 0.1534 0.1208 0.1454 0.1414 0.1538 0.1420 0.1428 0.1461
va: 1.2010 1.9123 2.6650 3.0781 3.4796 3.9063 3.8323 3.6837 3.9531 3.5415 3.9625 3.9284 4.0917 3.9580 4.0316 3.9479 3.9960 3.9595 3.9778 3.8334 1.0108 1.0005 0.9944 0.9916 1.0116 0.9983 0.9985 0.9910 0.9956 1.0103 1.0115 1.0186 1.0036 0.9941 1.0058 1.0053 0.9978
dispcorr: -0.019557056 hartree
energy: -1264.910224590726
dipole: 25.95286 -25.34421 0.60865 5.64479 -6.13760 -0.49280 4.43402 -3.94388 0.49015
magnitude: 0.92388 au
magnitude: 2.34831 debye
