program: Orca
programVersion: 4.2.1
elementType: Cl O N N C C C C C C C C C C C C C C C C H H H H H H H H H H H H H H H H H
charge: 0
multiplicity: 1
keywords: wb97x-d3
keywords: def2-TZVPP
keywords: def2/J RIJCOSX GRIDX6 NOFINALGRIDX
keywords: grid4 nofinalgrid
keywords: scfconv7
keywords: smallprint printgap noloewdin
keywords: NOSOSCF
formula: C16H17ClN2O
InChI: InChI=1/C16H17ClN2O/c1-16(13-4-3-9-18-11-13)10-15(20-19(16)2)12-5-7-14(17)8-6-12/h3-9,11,15H,10H2,1-2H3
37 atoms
Cl -5.879373 -1.110974 -0.571307
O  0.066663 1.781989 0.324774
N  1.471666 1.639973 0.124429
N  5.066397 -0.036114 1.263505
C  1.625419 0.225427 -0.264491
C  0.731827 -0.425091 0.802171
C  -0.353247 0.642789 1.049395
C  3.077517 -0.169545 -0.086343
C  1.102593 -0.095041 -1.665497
C  -1.735124 0.237451 0.608357
C  1.846453 2.613053 -0.873781
C  3.737141 -1.024991 -0.958443
C  3.806011 0.289408 1.011256
C  -2.370232 -0.798524 1.28948
C  -2.406374 0.851682 -0.441316
C  5.054522 -1.378319 -0.704253
C  -3.638321 -1.223664 0.932661
C  -3.681435 0.440094 -0.808854
C  5.67545 -0.859731 0.415525
C  -4.287033 -0.59499 -0.119579
H  0.326311 -1.379084 0.467907
H  1.290322 -0.606771 1.719719
H  -0.388649 0.875051 2.121019
H  1.053782 -1.172309 -1.820742
H  1.730767 0.324843 -2.451689
H  0.092754 0.288488 -1.80702
H  2.901297 2.472607 -1.106557
H  1.735005 3.617313 -0.466467
H  1.272001 2.551567 -1.803256
H  3.242398 -1.426109 -1.831632
H  3.339235 0.954858 1.725871
H  -1.870954 -1.288467 2.116627
H  -1.948093 1.661731 -0.99065
H  5.588396 -2.045419 -1.366314
H  -4.112949 -2.031637 1.471905
H  -4.191192 0.930214 -1.62669
H  6.704645 -1.113428 0.639084
elementType: Cl O N C H
totalener: -1264.88345906 hartree
nucrepener: 1616.84421842 hartree
electener: -2881.72767748 hartree
oneelecener: -4938.91166836 hartree
twoeener: 2057.18399088 hartree
cpcmener: -0.02398919 hartree
kineticenergy: 1260.66790167 hartree
xcener: -100.553799508292 hartree
chargesum: 0.0000000
charge: -0.104908 -0.346212 -0.091447 -0.372025 0.506041 -0.163476 0.235512 -0.230401 -0.387245 0.025155 -0.209792 -0.133550 -0.033114 -0.259004 -0.232227 -0.170915 -0.132284 -0.149334 0.014437 0.083879 0.099591 0.106419 0.113042 0.109031 0.117328 0.116263 0.113199 0.117834 0.093763 0.149795 0.123076 0.145054 0.150015 0.158179 0.145868 0.144560 0.147895
qa: -0.1049 -0.3462 -0.0914 -0.3720 0.5060 -0.1635 0.2355 -0.2304 -0.3872 0.0252 -0.2098 -0.1336 -0.0331 -0.2590 -0.2322 -0.1709 -0.1323 -0.1493 0.0144 0.0839 0.0996 0.1064 0.1130 0.1090 0.1173 0.1163 0.1132 0.1178 0.0938 0.1498 0.1231 0.1451 0.1500 0.1582 0.1459 0.1446 0.1479
va: 1.2005 1.8968 2.7143 3.0719 3.5635 3.8722 3.8364 3.7031 3.9515 3.5684 3.9616 3.9354 4.0738 4.0286 3.9718 3.9308 3.9533 4.0046 3.9815 3.8240 1.0174 1.0050 0.9984 1.0017 0.9913 1.0081 0.9927 0.9953 0.9982 1.0029 1.0461 1.0029 1.0206 0.9936 1.0038 1.0057 0.9979
dispcorr: -0.018789622 hartree
energy: -1264.902248680541
dipole: 23.68657 -23.18589 0.50068 4.03049 -5.00678 -0.97629 -3.99956 2.90175 -1.09780
magnitude: 1.55209 au
magnitude: 3.94511 debye
