program: Orca
programVersion: 4.2.1
elementType: Cl O N N C C C C C C C C C C C C C C C C H H H H H H H H H H H H H H H H H
charge: 0
multiplicity: 1
keywords: wb97x-d3
keywords: def2-TZVPP
keywords: def2/J RIJCOSX GRIDX6 NOFINALGRIDX
keywords: grid4 nofinalgrid
keywords: scfconv7
keywords: smallprint printgap noloewdin
keywords: NOSOSCF
formula: C16H17ClN2O
InChI: InChI=1/C16H17ClN2O/c1-16(13-4-3-9-18-11-13)10-15(20-19(16)2)12-5-7-14(17)8-6-12/h3-9,11,15H,10H2,1-2H3
37 atoms
Cl -6.041908 -0.149043 -0.142262
O  0.520085 1.227438 0.607238
N  0.942223 1.003675 -0.733669
N  5.376042 -0.190885 -0.506578
C  1.589926 -0.32652 -0.697415
C  0.620518 -1.082308 0.230883
C  -0.128274 0.036754 0.986623
C  2.99865 -0.270039 -0.122141
C  1.544067 -0.898776 -2.108335
C  -1.609866 0.042465 0.695952
C  1.765566 2.128312 -1.103869
C  3.236117 -0.132506 1.24477
C  4.125346 -0.288593 -0.94091
C  -2.419647 -0.883224 1.34779
C  -2.196578 0.917858 -0.21006
C  4.53489 -0.019483 1.710819
C  -3.780957 -0.95255 1.098359
C  -3.558757 0.862394 -0.470645
C  5.57387 -0.054021 0.796511
C  -4.340092 -0.076012 0.182334
H  -0.070031 -1.689853 -0.352661
H  1.140505 -1.758824 0.907013
H  0.012869 -0.058309 2.066812
H  2.081894 -0.289298 -2.835151
H  0.508752 -0.957288 -2.442037
H  1.965496 -1.903654 -2.139329
H  2.590015 2.333712 -0.412643
H  1.145308 3.02161 -1.179414
H  2.183564 1.942261 -2.09267
H  2.42666 -0.126291 1.962046
H  4.02305 -0.393083 -2.014132
H  -1.987141 -1.567796 2.068263
H  -1.599718 1.651012 -0.734006
H  4.739273 0.086415 2.767363
H  -4.393959 -1.677664 1.616339
H  -4.000892 1.547575 -1.181241
H  6.602915 0.022588 1.129203
elementType: Cl O N C H
totalener: -1264.88975421 hartree
nucrepener: 1629.58363895 hartree
electener: -2894.47339316 hartree
oneelecener: -4964.42944507 hartree
twoeener: 2069.95605191 hartree
cpcmener: -0.02122427 hartree
kineticenergy: 1260.66284982 hartree
xcener: -100.550756683930 hartree
chargesum: 0.0000000
charge: -0.104075 -0.338098 -0.084022 -0.361023 0.491256 -0.251533 0.322222 -0.192280 -0.338854 -0.024066 -0.207276 -0.149708 -0.023173 -0.265812 -0.223668 -0.168041 -0.140127 -0.153490 0.013248 0.096329 0.101946 0.113511 0.112402 0.095193 0.096459 0.125870 0.095568 0.114396 0.111888 0.146167 0.116914 0.138870 0.148627 0.154569 0.142693 0.141011 0.146108
qa: -0.1041 -0.3381 -0.0840 -0.3610 0.4913 -0.2515 0.3222 -0.1923 -0.3389 -0.0241 -0.2073 -0.1497 -0.0232 -0.2658 -0.2237 -0.1680 -0.1401 -0.1535 0.0132 0.0963 0.1019 0.1135 0.1124 0.0952 0.0965 0.1259 0.0956 0.1144 0.1119 0.1462 0.1169 0.1389 0.1486 0.1546 0.1427 0.1410 0.1461
va: 1.2014 1.9228 2.7308 3.0836 3.4649 3.9212 3.7350 3.6838 3.9720 3.5877 3.9796 3.9258 4.0799 4.0557 3.9970 3.9385 3.9691 4.0185 3.9905 3.8169 0.9965 1.0060 0.9955 1.0025 1.0139 0.9954 0.9974 0.9970 0.9928 1.0120 1.0156 1.0074 1.0209 0.9936 1.0057 1.0079 0.9976
dispcorr: -0.019178168 hartree
energy: -1264.908932380461
dipole: 24.66619 -24.21425 0.45194 -0.31275 -0.33635 -0.64910 -3.31313 4.00303 0.68989
magnitude: 1.04954 au
magnitude: 2.66771 debye
