program: Gaussian 09
title: 000068519
version: EM64L-G09RevD.01
frameworkgroup: C1[X(C14H10F3NO2)]
method: RPBEPBE
basis: SDD
operation: Freq
keyword: #p
keyword: freq=noraman
keyword: PBEPBE/SDD
title: #p freq=noraman PBEPBE/SDD
converged: YES YES NO NO
title: Mulliken charges:
elementType: F F F O O N C C C C C C C C C C C C C C H H H H H H H H H H
charge: -0.164466 -0.166923 -0.171144 -0.405028 -0.221855 -0.474035 0.532351 0.345687 -0.580779 0.134508 -0.346329 0.147218 -0.369179 -0.197668 0.252529 0.155232 -0.354193 -0.386787 -0.250626 -0.193444 0.255754 0.327500 0.317329 0.263231 0.237988 0.255776 0.224462 0.236817 0.234355 0.361716
chargesum: 0.00000
title: Mulliken charges with hydrogens summed into heavy atoms:
elementType: F F F O O N C C C C C C C C C C C C C C
charge: -0.164466 -0.166923 -0.171144 -0.043311 -0.221855 -0.146535 0.532351 0.345687 -0.325025 0.134508 -0.029000 0.147218 -0.105948 0.040320 0.252529 0.155232 -0.098417 -0.162325 -0.013808 0.040911
polarizability: 2.55909144e+02 -2.08030153e+01 1.65523881e+02 1.20453911e+01 8.01326929e+00 9.86333630e+01
1716.lowfreq: -2.9463 -0.0005 0.0004 0.0006 1.0358 6.2198 15.5182 24.4340 39.8100
frequency: 15.4317 24.4259 39.7622 51.5738 71.9758 119.2832 129.6982 161.5026 184.8260 200.7229 244.2060 269.6278 283.2012 307.0109 342.4812 345.4081 373.6374 399.0072 424.6219 429.9238 467.9438 488.6053 517.8573 524.9100 554.2908 590.2051 610.6299 619.7331 652.5982 665.0341 698.7730 699.1564 704.6096 756.5029 760.6749 803.3416 813.8663 847.1915 863.3090 873.4472 896.7089 934.3056 943.6793 979.0146 982.9386 983.5358 1005.6644 1012.8339 1033.8363 1044.7732 1070.1827 1104.2074 1110.1165 1155.6114 1175.4516 1187.6327 1227.7368 1244.8398 1254.6858 1293.3488 1304.7263 1315.8363 1381.1250 1389.3342 1418.1499 1429.2487 1482.7895 1491.1983 1512.9835 1592.1652 1600.3199 1607.3889 1619.9204 1627.4968 3119.2055 3130.0241 3140.7932 3148.9714 3150.4535 3171.8670 3174.7609 3197.2443 3522.3602 3578.4720
redmass: 15.6754 5.9038 5.9433 6.4456 6.6227 6.7387 7.1476 6.8326 6.9292 6.4813 5.6490 5.6235 6.6037 6.9454 3.4546 1.4363 5.6207 6.0825 4.7559 5.3462 4.3899 4.5610 6.3080 6.5714 6.1945 5.5302 9.6862 3.5038 4.2888 1.5653 4.9046 2.3482 5.8271 2.6880 1.7084 6.7691 1.4137 1.7200 3.7604 6.5976 1.6013 1.3822 1.3777 1.3265 10.1591 6.3455 1.3746 5.2628 4.0476 2.7679 2.6099 1.7484 1.9944 1.2463 1.0563 1.0938 2.5413 2.1151 2.6573 1.4444 2.7674 1.7956 4.0148 7.4910 3.7238 2.3286 2.8793 2.6027 2.1997 7.0521 5.5541 6.7199 5.8256 6.0261 1.0886 1.0889 1.0920 1.0925 1.0884 1.1003 1.0960 1.0958 1.0767 1.0662
irintensity: 0.0988 0.4725 3.6295 1.1719 3.7151 4.6130 0.2556 0.2592 1.3362 1.3536 3.9773 1.8852 5.0481 0.9243 17.4582 116.2234 8.9585 2.4374 13.5214 4.4653 4.3338 10.8775 6.3576 4.5027 3.5152 33.4509 6.6413 14.0639 6.8182 33.6202 25.2897 15.1226 16.2775 44.9652 41.9175 12.1463 62.0054 9.5705 19.9173 22.1855 63.6865 0.7352 7.4847 2.0558 207.7206 18.3520 11.8161 131.7778 143.3359 103.9333 70.9339 15.1540 58.6208 47.9056 4.9423 0.4074 186.1278 82.1989 24.4230 54.0578 143.2454 205.0159 112.3720 8.4382 9.3400 36.3141 282.9106 23.1581 318.4348 24.9733 15.0726 33.1444 95.1784 96.0443 12.7435 3.6864 4.7559 15.7889 7.6618 18.9035 3.7586 9.1642 13.7806 40.8433
temp: 298.150 k
press: 1.00000 atm
elementType: 9 9 9 8 8 7 6 6 6 6 6 6 6 6 6 6 6 6 6 6 1 1 1 1 1 1 1 1 1 1
symmnumber: 1
zpe: 554343.2 jmol-1
zpe.correction: 0.211138 hartree
zpe.thermalcorrener: 0.228494 hartree
zpe.thermalcorrenthalpy: 0.229438 hartree
zpe.thermalcorrgfe: 0.163170 hartree
zpe.sumelectzpe: -1042.820107 hartree
zpe.sumelectthermal: -1042.802751 hartree
zpe.sumelectthermalent: -1042.801807 hartree
zpe.sumelectthermalfe: -1042.868075 hartree
dipole: 5.2641 -1.3194 0.8343
dipole: 5.4906
quadrupole: -103.1556 -112.6483 -114.1249
quadrupole: -17.8660 11.9276 3.9391
quadrupole: 6.8206 -2.6720 -4.1486 -17.8660 11.9276 3.9391
hfenergy: -1043.0312453 hartree
pointgroup: C01 [X(C14H10F3N1O2)]
dipole: -2.0787581 -0.4817351 -0.3362847 debye
polarizability: 256.4686045|19.3380447|166.2646978|11.0801268|-2.553575|97.3330855 unknown
InChI: InChI=1S/C14H10F3NO2/c15-14(16,17)9-4-3-5-10(8-9)18-13(20)11-6-1-2-7-12(11)19/h1-8,18-19H
charge 0 multiplicity 1
30 atoms
F  5.478841 -0.288563 -1.050268
F  4.827878 -1.628838 0.652232
F  3.920904 -1.904346 -1.404286
O  -3.86246 1.532228 -1.321066
O  -1.698822 1.971441 0.714077
N  -0.463902 0.09072 0.024476
C  0.872068 0.554679 0.144558
C  3.255139 0.061848 -0.133144
C  1.908224 -0.340279 -0.228664
C  -2.881954 -0.095285 0.159262
C  1.204893 1.855145 0.6157
C  -1.656741 0.772817 0.318856
C  3.597996 1.351902 0.336107
C  2.560829 2.234127 0.703657
C  4.341967 -0.912386 -0.483122
C  -3.999218 0.338615 -0.607208
C  -2.972505 -1.330476 0.849972
C  -5.175521 -0.447849 -0.665977
C  -4.142953 -2.118854 0.796672
C  -5.24666 -1.669288 0.036995
H  1.667544 -1.342537 -0.601547
H  -0.580323 -0.850806 -0.359138
H  0.403801 2.542534 0.892085
H  4.646284 1.657396 0.399011
H  2.808845 3.238093 1.062828
H  -2.127743 -1.657121 1.468129
H  -6.030248 -0.107977 -1.265089
H  -4.196536 -3.062072 1.348739
H  -6.163047 -2.267046 -0.01154
H  -4.70228 1.768481 -1.788206
