program: Orca
programVersion: 4.2.1
elementType: Cl Cl O N N C C C C C C C C C C C C C C H H H H H H H H H H H H
charge: 0
multiplicity: 1
keywords: wb97x-d3
keywords: def2-TZVPP
keywords: def2/J RIJCOSX GRIDX6 NOFINALGRIDX
keywords: grid4 nofinalgrid
keywords: scfconv7
keywords: smallprint printgap noloewdin
keywords: NOSOSCF
formula: C14H12Cl2N2O
InChI: InChI=1/C14H12Cl2N2O/c1-19-18-14(7-10-3-2-6-17-9-10)12-5-4-11(15)8-13(12)16/h2-6,8-9H,7H2,1H3
31 atoms
Cl 0.069609 0.218872 2.419169
Cl -4.348641 -1.321375 -0.176806
O  3.608757 -1.756954 -0.148238
N  2.257991 -1.923917 -0.105323
N  0.368058 3.783849 0.177478
C  2.264774 0.539284 0.019279
C  1.619723 -0.824265 -0.01031
C  0.145919 -0.969148 -0.010557
C  1.348504 1.660751 -0.372915
C  -0.656607 -0.485072 1.018317
C  -0.486201 -1.594775 -1.081766
C  0.693949 1.676954 -1.599609
C  1.144629 2.746798 0.468728
C  -2.03736 -0.584556 0.980798
C  -1.863374 -1.715177 -1.145299
C  -2.626737 -1.197436 -0.112382
C  -0.126327 2.74635 -1.91484
C  -0.25902 3.772392 -0.993059
C  4.247679 -2.996753 -0.397292
H  2.68428 0.724474 1.011617
H  3.119994 0.524086 -0.661594
H  0.113211 -1.980653 -1.895094
H  0.826853 0.867162 -2.306944
H  1.646882 2.780612 1.429571
H  -2.638128 -0.201507 1.793664
H  -2.328946 -2.197687 -1.99292
H  -0.651618 2.789227 -2.858713
H  -0.893494 4.623008 -1.212246
H  3.949778 -3.419024 -1.358891
H  4.045566 -3.722899 0.392435
H  5.315084 -2.787533 -0.419777
elementType: Cl O N C H
totalener: -1645.85633608 hartree
nucrepener: 1639.00792404 hartree
electener: -3284.86426011 hartree
oneelecener: -5513.84986329 hartree
twoeener: 2228.98560318 hartree
cpcmener: -0.02306793 hartree
kineticenergy: 1641.45322951 hartree
xcener: -112.970818734996 hartree
chargesum: -0.0000000
charge: -0.073353 -0.082914 -0.243810 -0.141973 -0.370382 -0.079207 0.127250 0.025765 -0.019080 0.075471 -0.180649 -0.137578 -0.009355 -0.159526 -0.165874 0.116562 -0.164511 0.011790 -0.108621 0.119760 0.119856 0.151810 0.153032 0.124081 0.127315 0.149231 0.159064 0.147964 0.105398 0.105312 0.117169
qa: -0.0734 -0.0829 -0.2438 -0.1420 -0.3704 -0.0792 0.1273 0.0258 -0.0191 0.0755 -0.1806 -0.1376 -0.0094 -0.1595 -0.1659 0.1166 -0.1645 0.0118 -0.1086 0.1198 0.1199 0.1518 0.1530 0.1241 0.1273 0.1492 0.1591 0.1480 0.1054 0.1053 0.1172
va: 1.2532 1.2210 1.9506 2.8909 3.0681 3.8187 3.7972 3.5821 3.6027 3.8827 3.9695 3.9280 4.0377 4.0803 4.0156 3.8574 3.9093 3.9896 3.8832 1.0071 1.0181 1.0101 0.9951 1.0202 1.0215 1.0032 0.9915 0.9983 0.9935 0.9948 0.9937
dispcorr: -0.016259544 hartree
energy: -1645.872595620401
dipole: 20.08843 -19.33936 0.74908 -0.12671 -0.86466 -0.99136 -10.82769 9.28229 -1.54540
magnitude: 1.98297 au
magnitude: 5.04032 debye
