program: Orca
programVersion: 4.2.1
elementType: Cl Cl O N N C C C C C C C C C C C C C C H H H H H H H H H H H H
charge: 0
multiplicity: 1
keywords: wb97x-d3
keywords: def2-TZVPP
keywords: def2/J RIJCOSX GRIDX6 NOFINALGRIDX
keywords: grid4 nofinalgrid
keywords: scfconv7
keywords: smallprint printgap noloewdin
keywords: NOSOSCF
formula: C14H12Cl2N2O
InChI: InChI=1/C14H12Cl2N2O/c1-19-18-14(7-10-3-2-6-17-9-10)12-5-4-11(15)8-13(12)16/h2-6,8-9H,7H2,1H3
31 atoms
Cl -0.28099 -1.102908 2.862182
Cl -4.511281 -2.135849 -0.252589
O  3.302787 -0.548677 -0.217233
N  2.04802 -1.069064 -0.2762
N  0.154034 3.52269 -1.557956
C  1.434187 1.005965 0.926248
C  1.177269 -0.33966 0.29095
C  -0.219348 -0.815313 0.17405
C  1.436868 2.073273 -0.137757
C  -0.987191 -1.149979 1.285618
C  -0.816221 -0.920119 -1.078466
C  2.60953 2.549398 -0.709214
C  0.238914 2.605873 -0.607673
C  -2.305034 -1.55835 1.167867
C  -2.131565 -1.324622 -1.225313
C  -2.868608 -1.63647 -0.094978
C  2.53366 3.515138 -1.698758
C  1.282589 3.965298 -2.091387
C  4.213067 -1.429202 -0.837921
H  0.652366 1.219375 1.654737
H  2.381393 1.000871 1.465805
H  -0.23347 -0.666801 -1.95349
H  3.567911 2.170907 -0.379835
H  -0.703172 2.271536 -0.181897
H  -2.877939 -1.820445 2.045744
H  -2.57914 -1.392155 -2.206557
H  3.427198 3.913329 -2.159877
H  1.186569 4.717237 -2.866982
H  4.241977 -2.400202 -0.338882
H  5.191609 -0.959205 -0.75895
H  3.973774 -1.580842 -1.89271
totalener: -1645.84654267 hartree
nucrepener: 1599.84100511 hartree
electener: -3245.68754778 hartree
oneelecener: -5435.01670159 hartree
twoeener: 2189.32915381 hartree
kineticenergy: 1641.47858470 hartree
xcener: -112.970773952868 hartree
chargesum: -0.0000000
charge: -0.062818 -0.065882 -0.210472 -0.100308 -0.284712 -0.086407 0.106237 0.018380 0.037404 0.043869 -0.141827 -0.127889 -0.058165 -0.164310 -0.138822 0.105500 -0.117573 0.004856 -0.112636 0.112962 0.099614 0.128254 0.116674 0.109285 0.117402 0.126158 0.122798 0.118086 0.105505 0.098740 0.100097
qa: -0.0628 -0.0659 -0.2105 -0.1003 -0.2847 -0.0864 0.1062 0.0184 0.0374 0.0439 -0.1418 -0.1279 -0.0582 -0.1643 -0.1388 0.1055 -0.1176 0.0049 -0.1126 0.1130 0.0996 0.1283 0.1167 0.1093 0.1174 0.1262 0.1228 0.1181 0.1055 0.0987 0.1001
va: 1.2635 1.2390 1.9757 2.9218 3.1034 3.8444 3.8570 3.6341 3.5601 3.9254 3.9762 3.9976 4.1004 4.0814 4.0236 3.9299 3.9055 4.0233 3.9093 1.0192 1.0324 1.0160 1.0221 1.0067 1.0243 1.0110 1.0013 1.0008 0.9975 0.9955 0.9967
dispcorr: -0.015372796 hartree
energy: -1645.861915467776
dipole: 23.61279 -22.44539 1.16740 10.54654 -10.64853 -0.10199 -10.62140 10.48071 -0.14069
magnitude: 1.18026 au
magnitude: 2.99999 debye
