program: Orca
programVersion: 4.2.1
elementType: Cl Cl O N N C C C C C C C C C C C C C C H H H H H H H H H H H H
charge: 0
multiplicity: 1
keywords: wb97x-d3
keywords: def2-TZVPP
keywords: def2/J RIJCOSX GRIDX6 NOFINALGRIDX
keywords: grid4 nofinalgrid
keywords: scfconv7
keywords: smallprint printgap noloewdin
keywords: NOSOSCF
formula: C14H12Cl2N2O
InChI: InChI=1/C14H12Cl2N2O/c1-19-18-14(7-10-3-2-6-17-9-10)12-5-4-11(15)8-13(12)16/h2-6,8-9H,7H2,1H3
31 atoms
Cl -0.216385 -1.181677 2.842512
Cl -4.498363 -1.930605 -0.284451
O  3.383689 -0.678331 -0.198933
N  2.110476 -1.154572 -0.259006
N  -0.026785 3.547059 -1.309413
C  1.544245 0.954109 0.917747
C  1.260956 -0.38942 0.292129
C  -0.15289 -0.811094 0.165283
C  1.409763 2.027106 -0.130982
C  -0.92969 -1.150588 1.268668
C  -0.758062 -0.845163 -1.086684
C  2.483913 2.434364 -0.912664
C  0.178152 2.62628 -0.381031
C  -2.264227 -1.498355 1.144029
C  -2.089863 -1.188634 -1.240776
C  -2.835048 -1.50825 -0.118026
C  2.283096 3.402646 -1.881604
C  1.008383 3.924197 -2.043711
C  4.270272 -1.618626 -0.763433
H  0.829796 1.135408 1.721084
H  2.53873 0.972582 1.36224
H  -0.169041 -0.585018 -1.95546
H  3.462394 1.997823 -0.761902
H  -0.688757 2.34145 0.20847
H  -2.844832 -1.764945 2.015414
H  -2.543811 -1.202212 -2.221266
H  3.098085 3.748686 -2.502522
H  0.816014 4.682617 -2.794694
H  5.262932 -1.177021 -0.697103
H  4.03632 -1.817298 -1.811622
H  4.263017 -2.563045 -0.214889
totalener: -1645.84666308 hartree
nucrepener: 1603.93957418 hartree
electener: -3249.78623726 hartree
oneelecener: -5443.21307990 hartree
twoeener: 2193.42684264 hartree
kineticenergy: 1641.48050629 hartree
xcener: -112.971065666624 hartree
chargesum: -0.0000000
charge: -0.063060 -0.066176 -0.212893 -0.098517 -0.283529 -0.082255 0.099978 0.023509 0.024918 0.047321 -0.141768 -0.126277 -0.055019 -0.166264 -0.137346 0.106995 -0.117950 0.006499 -0.112702 0.112280 0.100031 0.126331 0.121073 0.105512 0.117439 0.125640 0.123612 0.118453 0.099820 0.099296 0.105049
qa: -0.0631 -0.0662 -0.2129 -0.0985 -0.2835 -0.0823 0.1000 0.0235 0.0249 0.0473 -0.1418 -0.1263 -0.0550 -0.1663 -0.1373 0.1070 -0.1180 0.0065 -0.1127 0.1123 0.1000 0.1263 0.1211 0.1055 0.1174 0.1256 0.1236 0.1185 0.0998 0.0993 0.1050
va: 1.2627 1.2385 1.9698 2.9188 3.0998 3.8379 3.8589 3.6429 3.5734 3.9184 3.9761 3.9885 4.0954 4.0862 4.0255 3.9290 3.9053 4.0216 3.9086 1.0205 1.0357 1.0147 1.0224 1.0092 1.0243 1.0109 1.0012 1.0006 0.9955 0.9972 0.9972
dispcorr: -0.015484831 hartree
energy: -1645.862147909858
dipole: 23.35309 -22.17308 1.18002 9.75286 -9.88526 -0.13239 -10.63936 10.36817 -0.27119
magnitude: 1.21799 au
magnitude: 3.09590 debye
