program: Orca
programVersion: 5.0.2
elementType: S O O N N C C C C C C C C C C C C C C C C C C H H H H H H H H H H H H H H H H H H H H H H
charge: 0
multiplicity: 1
keywords: wb97x-d3
keywords: def2-TZVPP
keywords: def2/J RIJCOSX
keywords: DEFGRID2
keywords: scfconv7
keywords: smallprint printgap noloewdin
keywords: NOSOSCF
formula: C18H22N2O2S
InChI: InChI=1/C18H22N2O2S/c1-18(2,3)13-8-6-9-14(12-13)22-17(23)20(4)15-10-7-11-16(19-15)21-5/h6-12H,1-5H3
45 atoms
S  -2.230528 1.074997 -1.333346
O  -0.337066 0.142461 0.259924
O  0.017095 -5.436538 0.520966
N  -1.923399 -1.3181 -0.231182
N  -0.907218 -3.364381 0.19102
C  2.589091 3.711297 -1.51252
C  1.640592 3.140101 -0.464475
C  1.971106 4.987027 -2.097266
C  2.847965 2.732479 -2.656155
C  3.931988 4.051049 -0.856081
C  1.055559 1.884532 -0.594258
C  1.319501 3.894962 0.668152
C  0.181204 1.421974 0.375477
C  0.449215 3.414828 1.632184
C  -0.137404 2.163668 1.493747
C  -1.484177 -0.062367 -0.399978
C  -1.329127 -2.214329 0.699793
C  -3.064042 -1.79507 -1.000421
C  -1.266163 -1.905581 2.043517
C  -0.707953 -2.858563 2.890713
C  -0.399304 -4.263422 1.006661
C  -0.264368 -4.058937 2.382995
C  -0.117272 -5.680287 -0.872522
H  1.801378 5.747039 -1.333376
H  2.634479 5.419701 -2.849133
H  1.01429 4.777455 -2.578997
H  3.533402 3.183631 -3.375167
H  3.305902 1.804375 -2.308769
H  1.933954 2.47797 -3.195918
H  4.6200 4.461461 -1.598066
H  3.828396 4.792535 -0.062897
H  4.399056 3.163382 -0.42561
H  1.264485 1.252202 -1.446241
H  1.754476 4.877114 0.804635
H  0.222261 4.018759 2.500797
H  -0.819639 1.776712 2.239821
H  -3.945058 -1.190965 -0.792211
H  -3.273909 -2.821631 -0.718318
H  -2.859169 -1.758724 -2.06864
H  -1.644997 -0.969183 2.426625
H  -0.635251 -2.659738 3.951451
H  0.162038 -4.823589 3.01727
H  0.455906 -4.969825 -1.468737
H  -1.159129 -5.653143 -1.192459
H  0.277715 -6.679246 -1.037537
elementType: S O N C H
totalener: -1357.40603449 hartree
nucrepener: 2044.63829284 hartree
electener: -3402.04432733 hartree
oneelecener: -5917.24197842 hartree
twoeener: 2515.19765108 hartree
cpcmener: -0.02689694 hartree
kineticenergy: 1352.48888027 hartree
xcener: -113.279976319864 hartree
chargesum: -0.0000000
charge: -0.432651 -0.286510 -0.320522 -0.043145 -0.409886 0.332794 -0.062979 -0.325303 -0.357326 -0.326910 -0.182252 -0.203802 0.231784 -0.181189 -0.189878 0.292544 0.224831 -0.152965 -0.234128 -0.091013 0.390089 -0.211015 -0.113766 0.097881 0.097520 0.101523 0.101643 0.104235 0.099455 0.097325 0.098121 0.102589 0.136172 0.144196 0.158752 0.154333 0.109942 0.106544 0.118617 0.163971 0.163791 0.151455 0.107306 0.107982 0.129846
qa: -0.4327 -0.2865 -0.3205 -0.0431 -0.4099 0.3328 -0.0630 -0.3253 -0.3573 -0.3269 -0.1823 -0.2038 0.2318 -0.1812 -0.1899 0.2925 0.2248 -0.1530 -0.2341 -0.0910 0.3901 -0.2110 -0.1138 0.0979 0.0975 0.1015 0.1016 0.1042 0.0995 0.0973 0.0981 0.1026 0.1362 0.1442 0.1588 0.1543 0.1099 0.1065 0.1186 0.1640 0.1638 0.1515 0.1073 0.1080 0.1298
va: 1.9771 2.1130 2.0827 3.2228 2.9825 3.6042 3.6955 3.9191 3.9273 3.9182 4.0449 3.9590 3.7380 3.9495 4.0173 4.2155 3.9694 3.8633 3.9241 3.9286 3.9645 3.9054 3.8592 1.0041 1.0041 1.0040 1.0066 1.0006 1.0018 1.0036 1.0042 1.0030 1.0130 1.0026 0.9923 0.9972 1.0066 1.0097 0.9993 0.9977 0.9892 1.0037 0.9970 0.9952 0.9937
dispcorr: -0.021373367 hartree
energy: -1357.427407858998
dipole: 16.65907 -16.07341 0.58566 14.87622 -15.91192 -1.03571 -10.15523 11.33771 1.18248
magnitude: 1.67748 au
magnitude: 4.26383 debye
