program: Orca
programVersion: 5.0.2
elementType: S O O N N C C C C C C C C C C C C C C C C C C H H H H H H H H H H H H H H H H H H H H H H
charge: 0
multiplicity: 1
keywords: wb97x-d3
keywords: def2-TZVPP
keywords: def2/J RIJCOSX
keywords: DEFGRID2
keywords: scfconv7
keywords: smallprint printgap noloewdin
keywords: NOSOSCF
formula: C18H22N2O2S
InChI: InChI=1/C18H22N2O2S/c1-18(2,3)13-8-6-9-14(12-13)22-17(23)20(4)15-10-7-11-16(19-15)21-5/h6-12H,1-5H3
45 atoms
S  -2.454497 1.931921 0.931311
O  -1.434016 0.060068 -0.62575
O  1.597469 -3.143917 0.614262
N  -2.271362 -0.693596 1.278656
N  -0.340332 -1.965689 0.942427
C  2.775265 2.646356 -0.530882
C  1.503911 2.167213 -1.221429
C  2.746889 4.17713 -0.444708
C  3.995525 2.200869 -1.346093
C  2.914683 2.087992 0.884329
C  0.575489 1.356715 -0.581111
C  1.241129 2.541518 -2.544079
C  -0.570215 0.941591 -1.246461
C  0.097044 2.115801 -3.196448
C  -0.830692 1.30638 -2.550136
C  -2.021303 0.392477 0.535165
C  -1.666679 -1.947128 0.983722
C  -3.093398 -0.58502 2.474655
C  -2.451493 -3.066712 0.80647
C  -1.796829 -4.274495 0.573691
C  0.263452 -3.105995 0.691313
C  -0.422864 -4.311292 0.506542
C  2.315471 -1.919096 0.70031
H  3.648576 4.545959 0.048318
H  2.697508 4.641864 -1.430433
H  1.887237 4.524042 0.131452
H  4.914829 2.535416 -0.861488
H  4.039824 1.113196 -1.428571
H  3.9898 2.612575 -2.355739
H  3.837863 2.458098 1.332434
H  2.093591 2.396465 1.533844
H  2.962829 0.996843 0.89542
H  0.734381 1.027832 0.437095
H  1.940936 3.172346 -3.077634
H  -0.080577 2.415923 -4.220804
H  -1.726454 0.965435 -3.052566
H  -4.095025 -0.236172 2.230439
H  -2.646705 0.1086 3.185441
H  -3.164094 -1.561781 2.942923
H  -3.530003 -3.007268 0.845082
H  -2.369885 -5.180607 0.430989
H  0.114907 -5.229708 0.315449
H  3.364368 -2.181263 0.585018
H  2.17658 -1.429734 1.664777
H  2.032203 -1.229531 -0.096269
elementType: S O N C H
totalener: -1357.40469438 hartree
nucrepener: 2125.92179032 hartree
electener: -3483.32648469 hartree
oneelecener: -6079.88727901 hartree
twoeener: 2596.56079432 hartree
cpcmener: -0.02818841 hartree
kineticenergy: 1352.48503732 hartree
xcener: -113.279596368664 hartree
chargesum: -0.0000000
charge: -0.422270 -0.290660 -0.323449 -0.045931 -0.394098 0.324298 -0.025506 -0.327526 -0.326374 -0.347663 -0.209833 -0.222467 0.261959 -0.159054 -0.236494 0.273680 0.203480 -0.150391 -0.216642 -0.086008 0.387743 -0.214212 -0.107986 0.097626 0.097351 0.101629 0.097889 0.101390 0.098201 0.103550 0.100781 0.093446 0.135777 0.144119 0.157993 0.151717 0.117909 0.111024 0.114734 0.165455 0.165046 0.151460 0.133043 0.108326 0.106935
qa: -0.4223 -0.2907 -0.3234 -0.0459 -0.3941 0.3243 -0.0255 -0.3275 -0.3264 -0.3477 -0.2098 -0.2225 0.2620 -0.1591 -0.2365 0.2737 0.2035 -0.1504 -0.2166 -0.0860 0.3877 -0.2142 -0.1080 0.0976 0.0974 0.1016 0.0979 0.1014 0.0982 0.1036 0.1008 0.0934 0.1358 0.1441 0.1580 0.1517 0.1179 0.1110 0.1147 0.1655 0.1650 0.1515 0.1330 0.1083 0.1069
va: 1.9944 2.0859 2.0873 3.2360 3.0005 3.6139 3.6774 3.9171 3.9187 3.9258 3.9261 3.9718 3.6856 3.9418 4.0649 4.2533 3.9813 3.8568 3.9066 3.9237 3.9664 3.9033 3.8607 1.0035 1.0042 1.0040 1.0036 1.0035 1.0045 1.0084 1.0014 1.0077 1.0189 1.0020 0.9903 1.0024 0.9996 1.0063 1.0010 0.9952 0.9881 1.0039 0.9960 0.9952 0.9897
dispcorr: -0.023890425 hartree
energy: -1357.428584801434
dipole: 22.88864 -22.32184 0.56679 11.15800 -13.13751 -1.97951 0.36697 -0.17894 0.18803
magnitude: 2.06762 au
magnitude: 5.25548 debye
