program: Gaussian 09
title: 000068506
version: EM64L-G09RevD.01
frameworkgroup: C1[X(C13H6Cl6O2)]
method: RPBEPBE
basis: SDD
operation: Freq
keyword: #p
keyword: freq=noraman
keyword: PBEPBE/SDD
title: #p freq=noraman PBEPBE/SDD
converged: YES YES NO NO
title: Mulliken charges:
elementType: Cl Cl Cl Cl Cl Cl O O C C C C C C C C C C C C C H H H H H H
charge: 0.010459 -0.001020 0.036702 0.038126 -0.001569 0.002403 -0.435109 -0.431526 -0.667692 0.563039 0.547925 0.191886 0.193618 -0.297101 -0.308328 -0.423608 -0.411573 -0.129543 -0.113874 -0.075028 -0.079187 0.261455 0.289195 0.254474 0.253271 0.367156 0.365451
chargesum: 0.00000
title: Mulliken charges with hydrogens summed into heavy atoms:
elementType: Cl Cl Cl Cl Cl Cl O O C C C C C C C C C C C C C
charge: 0.010459 -0.001020 0.036702 0.038126 -0.001569 0.002403 -0.067953 -0.066075 -0.117042 0.563039 0.547925 0.191886 0.193618 -0.297101 -0.308328 -0.169134 -0.158302 -0.129543 -0.113874 -0.075028 -0.079187
polarizability: 2.80174928e+02 3.26528379e+01 1.82079268e+02 1.50716190e-01 6.72265514e-01 1.61798469e+02
1716.lowfreq: -6.4055 -0.9657 -0.0019 -0.0012 0.0008 5.0031 23.8210 26.2559 30.8584
frequency: 23.8155 26.2556 30.8475 72.0637 74.7497 78.5338 101.8324 149.0894 167.6092 169.7345 192.7008 195.8140 208.9713 211.8737 242.4599 258.7474 270.8567 281.9490 303.0132 307.3301 324.2138 328.4296 330.2750 345.2332 361.5954 412.6930 416.0076 416.6210 457.0722 526.3174 533.0314 553.1973 559.2043 591.4544 613.0856 619.0756 649.5359 698.4419 705.1209 734.9128 764.7727 814.9350 818.4254 819.2247 866.1243 902.8300 916.6702 954.0974 1101.8035 1106.8160 1157.3398 1160.6867 1179.0925 1207.9874 1255.9994 1257.2040 1266.7772 1327.1767 1346.0897 1351.1935 1377.3986 1383.0591 1442.3287 1450.5655 1464.8922 1577.5214 1580.2153 1582.8130 1585.1105 3018.7403 3073.7099 3150.8432 3152.9871 3581.3934 3591.3794
redmass: 15.1956 18.7599 15.7044 17.0176 28.0454 12.3880 9.8015 14.9562 9.8701 9.0497 26.0037 22.6584 30.5180 23.8306 4.9774 5.0133 4.2050 6.7466 1.3005 3.7266 1.7292 21.8797 7.0251 4.7492 3.4315 11.0620 8.1513 12.7300 8.9955 4.4731 4.5881 5.4027 5.3527 6.0975 9.2074 8.5207 8.4470 5.7763 5.9224 9.1282 7.6197 3.4475 1.5346 1.7761 6.5595 7.0097 10.2294 2.6275 3.0189 2.3483 1.7259 1.7980 1.5826 2.0476 3.2415 1.8566 2.6673 2.3953 7.2794 4.0893 3.9466 4.4345 2.3243 3.1063 1.4230 7.5727 7.6487 7.7384 8.4092 1.0590 1.1001 1.0925 1.0925 1.0662 1.0663
irintensity: 0.3850 0.3387 0.0739 0.1219 0.0629 0.0934 0.2026 0.4291 0.2940 0.5215 0.0552 0.2433 0.1101 0.0686 4.7822 19.1956 8.8514 6.2242 83.3721 12.8752 49.9159 0.9762 9.8900 34.6604 35.9710 16.2720 5.9826 2.9729 6.1287 4.6366 11.8148 0.0455 9.3439 20.5375 1.9462 26.4811 11.3648 5.9732 3.8556 69.9676 37.2296 12.0400 30.7608 43.7678 21.5419 3.9037 17.8783 92.0610 151.3161 100.9180 14.4128 32.0374 61.5027 72.1282 0.3260 12.1582 3.8334 94.8004 59.8519 93.4252 11.2395 29.5616 56.5390 113.2201 2.4714 83.2557 50.6036 50.6674 17.0324 0.8622 17.3643 1.8361 2.5212 50.2648 51.5235
temp: 298.150 k
press: 1.00000 atm
elementType: 17 17 17 17 17 17 8 8 6 6 6 6 6 6 6 6 6 6 6 6 6 1 1 1 1 1 1
symmnumber: 1
zpe: 407519.7 jmol-1
zpe.correction: 0.155216 hartree
zpe.thermalcorrener: 0.176058 hartree
zpe.thermalcorrenthalpy: 0.177002 hartree
zpe.thermalcorrgfe: 0.103298 hartree
zpe.sumelectzpe: -3408.271880 hartree
zpe.sumelectthermal: -3408.251038 hartree
zpe.sumelectthermalent: -3408.250094 hartree
zpe.sumelectthermalfe: -3408.323798 hartree
dipole: 2.2439 5.6511 0.4414
dipole: 6.0963
quadrupole: -173.3018 -147.6010 -157.7273
quadrupole: 9.5555 8.3928 -1.9851
quadrupole: -13.7584 11.9424 1.8160 9.5555 8.3928 -1.9851
hfenergy: -3408.4270957 hartree
pointgroup: C01 [X(C13H6Cl6O2)]
dipole: -0.858576 2.2223014 -0.2771067 debye
polarizability: 279.1651759|-34.1154435|182.9463115|-1.8076724|-0.7758997|161.9411776 unknown
InChI: InChI=1S/C13H6Cl6O2/c14-6-2-8(20)4(10(16)12(6)18)1-5-9(21)3-7(15)13(19)11(5)17/h2-3,20-21H,1H2
charge 0 multiplicity 1
27 atoms
Cl -0.524223 -2.276405 0.395255
Cl 2.394024 -1.874141 -2.080169
Cl -3.390365 -2.27935 1.857193
Cl 4.96294 -1.584934 -0.186932
Cl -5.514369 0.1037 1.187324
Cl 4.990346 0.70162 2.131425
O  -1.919745 2.082875 -2.029199
O  0.242329 2.091834 0.492365
C  0.037096 0.137356 -1.53519
C  -1.311772 0.092455 -0.828256
C  1.262528 0.231464 -0.632701
C  -2.283527 1.093439 -1.105367
C  1.341633 1.230152 0.377693
C  -1.693022 -0.930866 0.068191
C  2.396927 -0.601924 -0.784256
C  -3.553994 1.090079 -0.493354
C  2.469617 1.363766 1.213459
C  -2.958714 -0.96157 0.707788
C  3.548983 -0.492343 0.035776
C  -3.877543 0.066912 0.415461
C  3.563059 0.498648 1.038978
H  0.141278 -0.759666 -2.170076
H  0.026521 1.013971 -2.206782
H  -4.292706 1.868095 -0.712147
H  2.51041 2.132483 1.992338
H  -2.641138 2.748454 -2.147353
H  0.369629 2.738696 1.229837
