program: Orca
programVersion: 5.0.2
elementType: S O O N N C C C C C C C C C C C C C C C C C C H H H H H H H H H H H H H H H H H H H H H H
charge: 0
multiplicity: 1
keywords: wb97x-d3
keywords: def2-TZVPP
keywords: def2/J RIJCOSX
keywords: DEFGRID2
keywords: scfconv7
keywords: smallprint printgap noloewdin
keywords: NOSOSCF
formula: C18H22N2O2S
InChI: InChI=1/C18H22N2O2S/c1-18(2,3)13-8-6-9-14(12-13)22-17(23)20(4)15-10-7-11-16(19-15)21-5/h6-12H,1-5H3
45 atoms
S  -1.576106 0.203269 -0.367229
O  0.675081 0.563645 0.969477
O  -1.11075 -5.630325 -0.500614
N  -0.172358 -1.444963 1.20025
N  -0.702576 -3.528907 0.325191
C  2.420656 4.055221 -1.989132
C  1.550016 3.643471 -0.807343
C  2.444524 5.569501 -2.188581
C  1.869221 3.408338 -3.265051
C  3.858635 3.576562 -1.759052
C  1.454862 2.291459 -0.464049
C  0.826904 4.557519 -0.046182
C  0.668666 1.897942 0.598322
C  0.036974 4.142709 1.02087
C  -0.052232 2.803865 1.356744
C  -0.339121 -0.242784 0.634867
C  -1.130222 -2.475962 1.006762
C  1.031391 -1.786519 1.958192
C  -2.384774 -2.385595 1.570513
C  -3.242186 -3.466794 1.390556
C  -1.51949 -4.550189 0.172532
C  -2.818737 -4.572268 0.685862
C  0.203647 -5.634384 -1.040175
H  1.45302 5.973103 -2.40105
H  2.84332 6.094082 -1.318444
H  3.083468 5.815523 -3.037964
H  0.841425 3.722597 -3.455413
H  2.471603 3.698573 -4.128323
H  1.880515 2.318965 -3.208604
H  4.279272 4.004024 -0.847026
H  3.924176 2.490567 -1.680758
H  4.494165 3.881182 -2.592989
H  1.998147 1.537825 -1.021293
H  0.870044 5.613698 -0.271427
H  -0.512221 4.876003 1.596528
H  -0.657178 2.470602 2.189784
H  1.162678 -1.119176 2.807516
H  1.922531 -1.755791 1.333001
H  0.921078 -2.795027 2.343207
H  -2.686345 -1.511129 2.127601
H  -4.237179 -3.443882 1.813966
H  -3.458249 -5.431172 0.537022
H  0.321961 -6.600066 -1.525119
H  0.963923 -5.531886 -0.265123
H  0.342426 -4.845865 -1.78035
elementType: S O N C H
totalener: -1357.40536925 hartree
nucrepener: 2022.99338513 hartree
electener: -3380.39875438 hartree
oneelecener: -5874.30744985 hartree
twoeener: 2493.90869547 hartree
cpcmener: -0.02895207 hartree
kineticenergy: 1352.48270110 hartree
xcener: -113.277823783235 hartree
chargesum: -0.0000000
charge: -0.445159 -0.292347 -0.321405 -0.050561 -0.393641 0.335822 -0.060323 -0.356511 -0.328694 -0.328469 -0.203202 -0.187634 0.202027 -0.148188 -0.199553 0.317061 0.181475 -0.172706 -0.191746 -0.100815 0.378896 -0.193419 -0.112516 0.101335 0.103747 0.100763 0.102510 0.098626 0.097295 0.102722 0.097617 0.097737 0.135790 0.148147 0.158971 0.156194 0.119005 0.128297 0.108977 0.156526 0.162940 0.150924 0.129518 0.106597 0.107369
qa: -0.4452 -0.2923 -0.3214 -0.0506 -0.3936 0.3358 -0.0603 -0.3565 -0.3287 -0.3285 -0.2032 -0.1876 0.2020 -0.1482 -0.1996 0.3171 0.1815 -0.1727 -0.1917 -0.1008 0.3789 -0.1934 -0.1125 0.1013 0.1037 0.1008 0.1025 0.0986 0.0973 0.1027 0.0976 0.0977 0.1358 0.1481 0.1590 0.1562 0.1190 0.1283 0.1090 0.1565 0.1629 0.1509 0.1295 0.1066 0.1074
va: 1.9330 2.1279 2.0811 3.1818 2.9932 3.6129 3.6915 3.9230 3.9191 3.9173 4.1452 3.8825 3.7270 3.9357 4.0342 4.1810 3.9928 3.8842 3.9436 3.9468 3.9767 3.8860 3.8588 1.0002 1.0003 1.0070 1.0041 1.0036 1.0034 1.0034 1.0039 1.0033 1.0138 0.9993 0.9915 0.9957 0.9962 0.9894 1.0040 1.0042 0.9893 1.0036 0.9937 0.9961 0.9971
dispcorr: -0.021090367 hartree
energy: -1357.426459615152
dipole: 20.18040 -19.04720 1.13320 17.80701 -18.35200 -0.54499 -11.35780 12.59677 1.23897
magnitude: 1.76528 au
magnitude: 4.48698 debye
