program: Orca
programVersion: 5.0.2
elementType: S O O N N C C C C C C C C C C C C C C C C C C H H H H H H H H H H H H H H H H H H H H H H
charge: 0
multiplicity: 1
keywords: wb97x-d3
keywords: def2-TZVPP
keywords: def2/J RIJCOSX
keywords: DEFGRID2
keywords: scfconv7
keywords: smallprint printgap noloewdin
keywords: NOSOSCF
formula: C18H22N2O2S
InChI: InChI=1/C18H22N2O2S/c1-18(2,3)13-8-6-9-14(12-13)22-17(23)20(4)15-10-7-11-16(19-15)21-5/h6-12H,1-5H3
45 atoms
S  -2.22562 0.959283 -1.476616
O  -0.422229 -0.029542 0.180468
O  0.767169 -4.369019 0.899177
N  -2.388973 -1.042987 0.259067
N  -0.80731 -2.728205 0.616504
C  2.086876 4.182111 -0.456438
C  1.811158 2.71566 -0.76997
C  1.165155 4.724266 0.634231
C  1.868797 5.010814 -1.728322
C  3.537374 4.3444 0.012344
C  0.796758 1.998606 -0.142787
C  2.574427 2.0540 -1.736902
C  0.562433 0.678506 -0.488967
C  2.334347 0.729635 -2.063879
C  1.314425 0.022309 -1.441286
C  -1.661524 -0.078645 -0.326111
C  -1.806546 -2.013561 1.118529
C  -3.82316 -1.116927 0.013172
C  -2.327994 -2.211764 2.380476
C  -1.769457 -3.231155 3.149227
C  -0.264346 -3.659896 1.367896
C  -0.720202 -3.971003 2.653951
C  1.287646 -4.041546 -0.382735
H  1.397838 5.773724 0.820815
H  0.112871 4.670995 0.349236
H  1.287611 4.191087 1.57887
H  0.841746 4.921794 -2.087034
H  2.061891 6.066938 -1.529058
H  2.532767 4.702842 -2.537131
H  3.74479 5.392225 0.238608
H  3.729793 3.764926 0.917037
H  4.253405 4.026604 -0.746552
H  0.171826 2.453155 0.613707
H  3.372141 2.57753 -2.248717
H  2.941948 0.241424 -2.814359
H  1.112458 -1.011394 -1.692054
H  -4.207909 -2.036148 0.443801
H  -4.023014 -1.127172 -1.056155
H  -4.346233 -0.271005 0.457287
H  -3.13989 -1.604227 2.754936
H  -2.152407 -3.432028 4.140693
H  -0.259365 -4.762596 3.228468
H  0.543141 -4.159251 -1.170559
H  2.102594 -4.739063 -0.559218
H  1.6798 -3.023609 -0.412132
elementType: S O N C H
totalener: -1357.40427331 hartree
nucrepener: 2074.20878126 hartree
electener: -3431.61305457 hartree
oneelecener: -5976.73770642 hartree
twoeener: 2545.12465185 hartree
cpcmener: -0.02798686 hartree
kineticenergy: 1352.48462269 hartree
xcener: -113.279130181644 hartree
chargesum: 0.0000000
charge: -0.432314 -0.282497 -0.321290 -0.048286 -0.388621 0.335478 -0.069225 -0.356441 -0.324922 -0.326157 -0.178142 -0.198430 0.233021 -0.195131 -0.183663 0.283375 0.200885 -0.160541 -0.229546 -0.082620 0.390082 -0.218717 -0.111269 0.101092 0.099467 0.103127 0.100922 0.097454 0.097234 0.097722 0.102196 0.097425 0.133359 0.143273 0.158328 0.157593 0.116490 0.107057 0.123967 0.166090 0.165697 0.151259 0.107361 0.131825 0.106038
qa: -0.4323 -0.2825 -0.3213 -0.0483 -0.3886 0.3355 -0.0692 -0.3564 -0.3249 -0.3262 -0.1781 -0.1984 0.2330 -0.1951 -0.1837 0.2834 0.2009 -0.1605 -0.2295 -0.0826 0.3901 -0.2187 -0.1113 0.1011 0.0995 0.1031 0.1009 0.0975 0.0972 0.0977 0.1022 0.0974 0.1334 0.1433 0.1583 0.1576 0.1165 0.1071 0.1240 0.1661 0.1657 0.1513 0.1074 0.1318 0.1060
va: 1.9788 2.1146 2.0835 3.2259 2.9973 3.6016 3.6999 3.9281 3.9193 3.9184 4.0513 3.9593 3.7416 3.9819 3.9902 4.2327 4.0080 3.8567 3.9064 3.9162 3.9682 3.9046 3.8559 1.0069 1.0019 1.0007 1.0046 1.0038 1.0044 1.0034 1.0034 1.0043 1.0141 1.0026 0.9935 0.9991 1.0001 1.0125 0.9945 0.9941 0.9879 1.0044 0.9978 0.9947 0.9918
dispcorr: -0.022047359 hartree
energy: -1357.426320666875
dipole: 13.77578 -13.62375 0.15203 20.85156 -21.84436 -0.99280 -1.31538 2.77663 1.46125
magnitude: 1.77313 au
magnitude: 4.50695 debye
