program: Orca
programVersion: 5.0.2
elementType: S O O N N C C C C C C C C C C C C C C C C C C H H H H H H H H H H H H H H H H H H H H H H
charge: 0
multiplicity: 1
keywords: wb97x-d3
keywords: def2-TZVPP
keywords: def2/J RIJCOSX
keywords: DEFGRID2
keywords: scfconv7
keywords: smallprint printgap noloewdin
keywords: NOSOSCF
formula: C18H22N2O2S
InChI: InChI=1/C18H22N2O2S/c1-18(2,3)13-8-6-9-14(12-13)22-17(23)20(4)15-10-7-11-16(19-15)21-5/h6-12H,1-5H3
45 atoms
S  -2.712564 1.266234 -1.058924
O  -1.106733 0.376606 0.838328
O  1.643467 -3.20416 0.686374
N  -2.441214 -1.161656 -0.01799
N  -0.39726 -2.223258 0.361222
C  2.585236 2.444359 -1.707458
C  1.59522 2.419894 -0.548043
C  4.014329 2.406882 -1.15348
C  2.382098 3.733307 -2.512932
C  2.403557 1.256026 -2.649736
C  0.651785 1.410686 -0.401451
C  1.622395 3.432405 0.417376
C  -0.233772 1.429106 0.666881
C  0.738136 3.433133 1.4818
C  -0.210777 2.426405 1.617931
C  -2.054156 0.12177 -0.071717
C  -1.680631 -2.133987 0.684605
C  -3.614566 -1.592861 -0.762253
C  -2.291122 -2.94769 1.616965
C  -1.498194 -3.909219 2.240427
C  0.34554 -3.115251 0.976926
C  -0.159996 -4.003881 1.933796
C  2.189124 -2.286762 -0.251775
H  4.234335 3.269547 -0.522983
H  4.18584 1.507711 -0.558399
H  4.739864 2.407451 -1.96998
H  2.545166 4.626691 -1.908333
H  3.082428 3.774747 -3.350246
H  1.371804 3.789923 -2.922854
H  3.126058 1.320895 -3.465077
H  2.56891 0.299799 -2.14773
H  1.409291 1.23334 -3.100179
H  0.593004 0.593924 -1.108625
H  2.345912 4.234538 0.341137
H  0.780756 4.227734 2.21553
H  -0.907983 2.418877 2.445783
H  -3.766637 -2.655259 -0.597585
H  -3.475735 -1.424492 -1.829437
H  -4.503232 -1.054196 -0.437356
H  -3.338813 -2.837685 1.859975
H  -1.933377 -4.571697 2.976947
H  0.48405 -4.732086 2.407484
H  2.119404 -1.257198 0.10407
H  1.706144 -2.363132 -1.226762
H  3.23807 -2.555477 -0.353165
elementType: S O N C H
totalener: -1357.41608410 hartree
nucrepener: 2119.42823994 hartree
electener: -3476.84432404 hartree
oneelecener: -6066.80932961 hartree
twoeener: 2589.96500557 hartree
cpcmener: -0.02403064 hartree
kineticenergy: 1352.49815438 hartree
xcener: -113.282020826557 hartree
chargesum: -0.0000000
charge: -0.417212 -0.279580 -0.311679 -0.050392 -0.389653 0.315583 -0.021100 -0.323873 -0.325070 -0.344620 -0.208354 -0.216151 0.256996 -0.159433 -0.224091 0.274930 0.203396 -0.152206 -0.221350 -0.085802 0.385411 -0.215618 -0.111432 0.097131 0.101548 0.096594 0.096350 0.096136 0.103067 0.101285 0.091542 0.102431 0.136622 0.140558 0.153733 0.147035 0.110630 0.110772 0.117993 0.162188 0.161849 0.148920 0.105778 0.108356 0.130780
qa: -0.4172 -0.2796 -0.3117 -0.0504 -0.3897 0.3156 -0.0211 -0.3239 -0.3251 -0.3446 -0.2084 -0.2162 0.2570 -0.1594 -0.2241 0.2749 0.2034 -0.1522 -0.2213 -0.0858 0.3854 -0.2156 -0.1114 0.0971 0.1015 0.0966 0.0963 0.0961 0.1031 0.1013 0.0915 0.1024 0.1366 0.1406 0.1537 0.1470 0.1106 0.1108 0.1180 0.1622 0.1618 0.1489 0.1058 0.1084 0.1308
va: 1.9963 2.0999 2.1004 3.2312 2.9985 3.6324 3.6748 3.9202 3.9176 3.9273 3.9487 3.9762 3.7054 3.9522 4.0686 4.2465 3.9979 3.8599 3.9061 3.9267 3.9778 3.9052 3.8643 1.0046 1.0035 1.0042 1.0049 1.0038 1.0038 1.0086 1.0058 1.0014 1.0153 1.0028 0.9917 1.0031 1.0012 1.0070 0.9999 0.9957 0.9892 1.0048 0.9911 0.9965 0.9959
dispcorr: -0.023490516 hartree
energy: -1357.439574617978
dipole: 20.39469 -19.80105 0.59364 8.73405 -10.41031 -1.67626 -12.33928 13.03440 0.69511
magnitude: 1.90930 au
magnitude: 4.85307 debye
