program: Orca
programVersion: 5.0.2
elementType: S O O N N C C C C C C C C C C C C C C C C C C H H H H H H H H H H H H H H H H H H H H H H
charge: 0
multiplicity: 1
keywords: wb97x-d3
keywords: def2-TZVPP
keywords: def2/J RIJCOSX
keywords: DEFGRID2
keywords: scfconv7
keywords: smallprint printgap noloewdin
keywords: NOSOSCF
formula: C18H22N2O2S
InChI: InChI=1/C18H22N2O2S/c1-18(2,3)13-8-6-9-14(12-13)22-17(23)20(4)15-10-7-11-16(19-15)21-5/h6-12H,1-5H3
45 atoms
S  -2.241416 1.283687 1.488594
O  -0.444435 0.213046 -0.118712
O  0.083838 -5.373973 0.915339
N  -1.902267 -1.233588 0.711549
N  -0.861476 -3.29669 0.751643
C  2.9910 3.737769 -0.225633
C  1.642546 3.159909 -0.642898
C  3.747365 2.816395 0.728884
C  2.763153 5.081547 0.477325
C  3.857714 3.953836 -1.472364
C  1.161766 1.949448 -0.147814
C  0.841629 3.854596 -1.551737
C  -0.064588 1.462323 -0.566961
C  -0.382416 3.352194 -1.964092
C  -0.851113 2.141182 -1.477748
C  -1.521819 0.054501 0.65606
C  -1.234028 -2.267906 0.002628
C  -2.948591 -1.629491 1.644116
C  -1.051394 -2.221158 -1.366484
C  -0.406333 -3.30369 -1.957508
C  -0.275842 -4.324188 0.176376
C  -0.003093 -4.376545 -1.193635
C  -0.218799 -5.359599 2.302757
H  4.708307 3.264995 0.986684
H  3.206871 2.653135 1.663317
H  3.954614 1.841143 0.28382
H  3.715963 5.518943 0.783704
H  2.265688 5.805547 -0.170011
H  2.149818 4.96063 1.372401
H  3.403814 4.653442 -2.175471
H  4.8312 4.362031 -1.192205
H  4.032494 3.015897 -2.003177
H  1.732739 1.364693 0.561052
H  1.175582 4.802115 -1.955714
H  -0.979236 3.907456 -2.676183
H  -1.802264 1.739952 -1.803272
H  -3.826227 -1.003193 1.502695
H  -2.618258 -1.540804 2.678558
H  -3.22396 -2.661407 1.450405
H  -1.404447 -1.392417 -1.96224
H  -0.234511 -3.30687 -3.02581
H  0.490977 -5.234311 -1.628999
H  -1.292026 -5.287609 2.485901
H  0.283935 -4.543179 2.823507
H  0.1441 -6.306672 2.695292
elementType: S O N C H
totalener: -1357.41721344 hartree
nucrepener: 2040.93120807 hartree
electener: -3398.34842151 hartree
oneelecener: -5909.55936147 hartree
twoeener: 2511.21093996 hartree
cpcmener: -0.02259437 hartree
kineticenergy: 1352.48647529 hartree
xcener: -113.280983775818 hartree
chargesum: 0.0000000
charge: -0.419028 -0.282127 -0.309959 -0.051149 -0.405991 0.321630 -0.051631 -0.358839 -0.322062 -0.324087 -0.192435 -0.198352 0.230347 -0.176343 -0.173617 0.289804 0.239928 -0.161895 -0.236777 -0.086773 0.386478 -0.217438 -0.113088 0.100119 0.101339 0.103569 0.096548 0.096603 0.102636 0.096755 0.096422 0.102870 0.133092 0.139322 0.155133 0.147465 0.111191 0.120369 0.106114 0.155314 0.160488 0.147424 0.106365 0.106448 0.127818
qa: -0.4190 -0.2821 -0.3100 -0.0511 -0.4060 0.3216 -0.0516 -0.3588 -0.3221 -0.3241 -0.1924 -0.1984 0.2303 -0.1763 -0.1736 0.2898 0.2399 -0.1619 -0.2368 -0.0868 0.3865 -0.2174 -0.1131 0.1001 0.1013 0.1036 0.0965 0.0966 0.1026 0.0968 0.0964 0.1029 0.1331 0.1393 0.1551 0.1475 0.1112 0.1204 0.1061 0.1553 0.1605 0.1474 0.1064 0.1064 0.1278
va: 1.9911 2.1017 2.0945 3.2375 2.9808 3.6208 3.7113 3.9288 3.9205 3.9184 4.0552 3.9648 3.7428 3.9595 4.0011 4.2186 3.9682 3.8718 3.9294 3.9232 3.9802 3.9101 3.8632 1.0069 1.0006 1.0008 1.0037 1.0043 1.0038 1.0047 1.0041 1.0029 1.0172 1.0040 0.9931 1.0028 1.0103 0.9982 1.0086 1.0008 0.9898 1.0050 0.9949 0.9969 0.9941
dispcorr: -0.021178248 hartree
energy: -1357.438391691245
dipole: 19.40417 -18.78494 0.61923 14.88935 -16.10364 -1.21429 0.46264 -1.57429 -1.11166
magnitude: 1.75889 au
magnitude: 4.47076 debye
