program: Orca
programVersion: 5.0.2
elementType: S O O N N C C C C C C C C C C C C C C C C C C H H H H H H H H H H H H H H H H H H H H H H
charge: 0
multiplicity: 1
keywords: wb97x-d3
keywords: def2-TZVPP
keywords: def2/J RIJCOSX
keywords: DEFGRID2
keywords: scfconv7
keywords: smallprint printgap noloewdin
keywords: NOSOSCF
formula: C18H22N2O2S
InChI: InChI=1/C18H22N2O2S/c1-18(2,3)13-8-6-9-14(12-13)22-17(23)20(4)15-10-7-11-16(19-15)21-5/h6-12H,1-5H3
45 atoms
S  -2.454041 1.261457 -0.100532
O  -0.13492 0.022552 -0.324423
O  -0.735074 -5.628651 -0.205803
N  -1.747627 -1.207569 0.565418
N  -1.16904 -3.417928 0.183205
C  2.32476 4.229399 0.44193
C  1.655253 3.206492 -0.469319
C  3.808648 4.347584 0.06989
C  2.2335 3.838733 1.917098
C  1.637879 5.589201 0.260824
C  1.006633 2.080909 0.022775
C  1.680047 3.385856 -1.853609
C  0.417507 1.175294 -0.843089
C  1.086742 2.474979 -2.709272
C  0.443794 1.352398 -2.209651
C  -1.417928 -0.000555 0.056593
C  -0.814025 -2.26217 0.725801
C  -3.142445 -1.476903 0.8749
C  0.348512 -2.098815 1.456884
C  1.18341 -3.203448 1.582615
C  -0.380464 -4.460168 0.326091
C  0.834252 -4.408816 1.016175
C  -1.953576 -5.687763 -0.922756
H  4.308119 5.071879 0.716559
H  4.319863 3.390225 0.180516
H  3.950483 4.678816 -0.959175
H  2.719871 2.882568 2.118861
H  2.733399 4.590666 2.529278
H  1.200251 3.776362 2.262468
H  1.707405 5.949343 -0.76604
H  0.579717 5.531086 0.518653
H  2.10114 6.340152 0.904275
H  0.947717 1.889306 1.085122
H  2.174535 4.250711 -2.277373
H  1.122058 2.639576 -3.777933
H  -0.025197 0.632451 -2.866302
H  -3.224123 -2.487904 1.260264
H  -3.765734 -1.381675 -0.012656
H  -3.504016 -0.771036 1.620443
H  0.59756 -1.15642 1.919868
H  2.105519 -3.117772 2.14191
H  1.457059 -5.287513 1.102305
H  -1.948714 -5.025345 -1.789463
H  -2.808881 -5.426588 -0.298334
H  -2.051554 -6.717837 -1.25569
totalener: -1357.39679291 hartree
nucrepener: 2045.78203772 hartree
electener: -3403.17883063 hartree
oneelecener: -5918.62770121 hartree
twoeener: 2515.44887058 hartree
kineticenergy: 1352.54383143 hartree
xcener: -113.290777904624 hartree
chargesum: 0.0000000
charge: -0.337225 -0.282211 -0.276123 -0.058272 -0.379939 0.244850 -0.020446 -0.287778 -0.340612 -0.287293 -0.121835 -0.171614 0.202861 -0.146045 -0.122777 0.241134 0.214877 -0.157357 -0.188422 -0.069158 0.356963 -0.194312 -0.117112 0.086574 0.098408 0.087036 0.093698 0.091485 0.099586 0.086490 0.105444 0.085863 0.102415 0.104845 0.120805 0.119272 0.090836 0.115224 0.113071 0.120002 0.127455 0.126921 0.104548 0.097884 0.119981
qa: -0.3372 -0.2822 -0.2761 -0.0583 -0.3799 0.2449 -0.0204 -0.2878 -0.3406 -0.2873 -0.1218 -0.1716 0.2029 -0.1460 -0.1228 0.2411 0.2149 -0.1574 -0.1884 -0.0692 0.3570 -0.1943 -0.1171 0.0866 0.0984 0.0870 0.0937 0.0915 0.0996 0.0865 0.1054 0.0859 0.1024 0.1048 0.1208 0.1193 0.0908 0.1152 0.1131 0.1200 0.1275 0.1269 0.1045 0.0979 0.1200
va: 2.0769 2.1008 2.1228 3.2122 2.9825 3.7471 3.7148 3.9219 3.9302 3.9227 4.0693 4.0221 3.8615 4.0327 4.0899 4.2543 4.0240 3.8875 3.9495 3.9541 4.0426 3.9391 3.8874 1.0069 1.0060 1.0085 1.0029 1.0124 1.0019 1.0080 1.0062 1.0060 1.0147 1.0123 1.0020 1.0065 1.0124 1.0032 1.0062 1.0130 0.9997 1.0116 0.9985 0.9967 0.9935
dispcorr: -0.021287177 hartree
energy: -1357.418080087370
dipole: 13.02286 -12.23179 0.79107 18.63858 -19.39865 -0.76008 4.08135 -3.75366 0.32769
magnitude: 1.14494 au
magnitude: 2.91020 debye
