program: Orca
programVersion: 5.0.2
elementType: S O O N N C C C C C C C C C C C C C C C C C C H H H H H H H H H H H H H H H H H H H H H H
charge: 0
multiplicity: 1
keywords: wb97x-d3
keywords: def2-TZVPP
keywords: def2/J RIJCOSX
keywords: DEFGRID2
keywords: scfconv7
keywords: smallprint printgap noloewdin
keywords: NOSOSCF
formula: C18H22N2O2S
InChI: InChI=1/C18H22N2O2S/c1-18(2,3)13-8-6-9-14(12-13)22-17(23)20(4)15-10-7-11-16(19-15)21-5/h6-12H,1-5H3
45 atoms
S  -2.406566 1.856299 0.754936
O  -1.317089 -0.041793 -0.726709
O  1.628334 -3.103527 0.801861
N  -2.349399 -0.775799 1.080679
N  -0.361536 -1.990635 0.946526
C  2.67097 2.788679 -0.306508
C  1.596747 2.140486 -1.173014
C  3.352205 1.729317 0.569528
C  2.002499 3.841228 0.588448
C  3.752904 3.473941 -1.141287
C  0.617165 1.36048 -0.564395
C  1.524104 2.317782 -2.552295
C  -0.401084 0.796566 -1.310445
C  0.501823 1.740957 -3.292361
C  -0.477096 0.978729 -2.678881
C  -1.992308 0.317548 0.37221
C  -1.685762 -2.015422 0.900263
C  -3.267956 -0.625696 2.195497
C  -2.416962 -3.17513 0.728925
C  -1.707244 -4.367428 0.611366
C  0.298339 -3.116436 0.796129
C  -0.332115 -4.357493 0.639101
C  2.279129 -1.847565 0.871464
H  3.811134 0.949481 -0.040645
H  4.137888 2.185845 1.174423
H  2.656266 1.249793 1.258741
H  1.2283 3.404961 1.220725
H  2.738878 4.316711 1.240212
H  1.530831 4.620269 -0.011681
H  4.512226 3.899695 -0.483677
H  4.255746 2.774716 -1.811923
H  3.353539 4.293245 -1.740804
H  0.636021 1.189666 0.504151
H  2.265282 2.910007 -3.069558
H  0.465097 1.893878 -4.362868
H  -1.280447 0.528648 -3.246064
H  -3.487386 -1.608256 2.604325
H  -4.193169 -0.153218 1.870216
H  -2.830591 -0.004385 2.977886
H  -3.49591 -3.152929 0.671324
H  -2.238424 -5.300687 0.478644
H  0.251861 -5.260898 0.53724
H  3.343729 -2.061984 0.817784
H  2.062675 -1.327195 1.805952
H  1.996369 -1.19662 0.042425
totalener: -1357.39375454 hartree
nucrepener: 2133.22452144 hartree
electener: -3490.61827598 hartree
oneelecener: -6093.49095082 hartree
twoeener: 2602.87267484 hartree
kineticenergy: 1352.54345717 hartree
xcener: -113.291222404465 hartree
chargesum: -0.0000000
charge: -0.330287 -0.276370 -0.277699 -0.072494 -0.357519 0.274644 0.051633 -0.323628 -0.280351 -0.333123 -0.230837 -0.181065 0.235117 -0.095208 -0.204519 0.238414 0.212961 -0.163553 -0.216952 -0.064863 0.359839 -0.196951 -0.120966 0.097156 0.095327 0.077312 0.092218 0.085692 0.099476 0.090517 0.100426 0.090543 0.118448 0.114546 0.119977 0.119490 0.092135 0.116171 0.115739 0.135956 0.130050 0.127486 0.121712 0.102580 0.110819
qa: -0.3303 -0.2764 -0.2777 -0.0725 -0.3575 0.2746 0.0516 -0.3236 -0.2804 -0.3331 -0.2308 -0.1811 0.2351 -0.0952 -0.2045 0.2384 0.2130 -0.1636 -0.2170 -0.0649 0.3598 -0.1970 -0.1210 0.0972 0.0953 0.0773 0.0922 0.0857 0.0995 0.0905 0.1004 0.0905 0.1184 0.1145 0.1200 0.1195 0.0921 0.1162 0.1157 0.1360 0.1300 0.1275 0.1217 0.1026 0.1108
va: 2.0901 2.1033 2.1341 3.2009 3.0188 3.7215 3.6210 3.9336 3.9275 3.9290 4.0384 3.9736 3.8225 3.9903 4.1092 4.2861 4.0177 3.8824 3.9309 3.9520 4.0443 3.9397 3.8950 1.0021 1.0135 1.0075 1.0096 1.0051 1.0079 1.0117 1.0018 1.0039 1.0195 1.0082 1.0021 1.0112 1.0015 1.0034 1.0059 1.0040 0.9989 1.0118 0.9969 0.9965 0.9901
dispcorr: -0.024129556 hartree
energy: -1357.417884093682
dipole: 21.21137 -20.85443 0.35694 12.62958 -13.86769 -1.23811 2.32348 -2.18584 0.13765
magnitude: 1.29587 au
magnitude: 3.29384 debye
