program: Orca
programVersion: 5.0.2
elementType: S O O N N C C C C C C C C C C C C C C C C C C H H H H H H H H H H H H H H H H H H H H H H
charge: 0
multiplicity: 1
keywords: wb97x-d3
keywords: def2-TZVPP
keywords: def2/J RIJCOSX
keywords: DEFGRID2
keywords: scfconv7
keywords: smallprint printgap noloewdin
keywords: NOSOSCF
formula: C18H22N2O2S
InChI: InChI=1/C18H22N2O2S/c1-18(2,3)13-8-6-9-14(12-13)22-17(23)20(4)15-10-7-11-16(19-15)21-5/h6-12H,1-5H3
45 atoms
S  -2.226299 1.836679 1.169346
O  -1.344002 0.063826 -0.580524
O  1.54743 -3.295373 0.418155
N  -2.261537 -0.814402 1.225139
N  -0.360087 -2.103643 0.814785
C  2.792444 2.691843 -0.373616
C  1.551483 2.240948 -1.136988
C  3.717309 3.552491 -1.234165
C  3.589243 1.468751 0.099535
C  2.34908 3.518423 0.8415
C  0.65261 1.373606 -0.521245
C  1.252368 2.677828 -2.425047
C  -0.501346 0.975782 -1.169979
C  0.094873 2.265548 -3.069819
C  -0.799227 1.411891 -2.447045
C  -1.915989 0.331288 0.600242
C  -1.683662 -2.055165 0.855168
C  -3.043203 -0.747487 2.446915
C  -2.491588 -3.146423 0.601695
C  -1.86307 -4.352747 0.303567
C  0.220804 -3.238152 0.496803
C  -0.490536 -4.417825 0.243295
C  2.272193 -2.088773 0.571934
H  4.599012 3.836796 -0.657902
H  4.064983 3.018827 -2.120631
H  3.234988 4.47559 -1.559338
H  3.896327 0.847043 -0.743335
H  4.490205 1.783335 0.629564
H  3.016284 0.843338 0.785606
H  3.216496 3.853001 1.414486
H  1.789689 4.401504 0.530891
H  1.706845 2.947321 1.512899
H  0.838339 1.003379 0.479284
H  1.920458 3.348957 -2.945554
H  -0.115171 2.621249 -4.069892
H  -1.708024 1.089508 -2.936731
H  -3.29113 -1.758036 2.759877
H  -3.959096 -0.182639 2.28593
H  -2.480261 -0.256684 3.241601
H  -3.568667 -3.05974 0.619843
H  -2.455691 -5.234921 0.100914
H  0.031647 -5.332703 0.002513
H  3.317678 -2.350586 0.429663
H  2.139099 -1.65611 1.564883
H  1.980115 -1.343994 -0.170665
totalener: -1357.39424006 hartree
nucrepener: 2127.48661970 hartree
electener: -3484.88085976 hartree
oneelecener: -6082.04518038 hartree
twoeener: 2597.16432062 hartree
kineticenergy: 1352.54609633 hartree
xcener: -113.290761069562 hartree
chargesum: -0.0000000
charge: -0.332946 -0.276570 -0.277806 -0.078345 -0.355042 0.271152 0.051005 -0.336079 -0.316475 -0.282588 -0.220897 -0.176828 0.215579 -0.097473 -0.191635 0.238974 0.211368 -0.161555 -0.215864 -0.064266 0.359863 -0.194694 -0.129572 0.090674 0.099240 0.092891 0.103036 0.094557 0.069104 0.085731 0.101636 0.090702 0.120100 0.115168 0.119910 0.118908 0.091967 0.114955 0.116303 0.136486 0.130239 0.128162 0.123080 0.106730 0.111116
qa: -0.3329 -0.2766 -0.2778 -0.0783 -0.3550 0.2712 0.0510 -0.3361 -0.3165 -0.2826 -0.2209 -0.1768 0.2156 -0.0975 -0.1916 0.2390 0.2114 -0.1616 -0.2159 -0.0643 0.3599 -0.1947 -0.1296 0.0907 0.0992 0.0929 0.1030 0.0946 0.0691 0.0857 0.1016 0.0907 0.1201 0.1152 0.1199 0.1189 0.0920 0.1150 0.1163 0.1365 0.1302 0.1282 0.1231 0.1067 0.1111
va: 2.0861 2.1038 2.1314 3.1998 3.0187 3.7295 3.6229 3.9307 3.9289 3.9266 4.0624 3.9652 3.8497 3.9931 4.1147 4.2866 4.0172 3.8816 3.9335 3.9510 4.0426 3.9368 3.8938 1.0119 1.0017 1.0033 1.0019 1.0128 1.0104 1.0050 1.0077 1.0096 1.0125 1.0081 1.0022 1.0103 1.0012 1.0051 1.0048 1.0046 0.9989 1.0116 0.9970 0.9939 0.9909
dispcorr: -0.023885178 hartree
energy: -1357.418125239573
dipole: 22.15891 -21.83901 0.31991 11.42551 -12.66925 -1.24373 1.00991 -1.06715 -0.05724
magnitude: 1.28549 au
magnitude: 3.26746 debye
