program: Orca
programVersion: 5.0.2
elementType: S O O N N C C C C C C C C C C C C C C C C C C H H H H H H H H H H H H H H H H H H H H H H
charge: 0
multiplicity: 1
keywords: wb97x-d3
keywords: def2-TZVPP
keywords: def2/J RIJCOSX
keywords: DEFGRID2
keywords: scfconv7
keywords: smallprint printgap noloewdin
keywords: NOSOSCF
formula: C18H22N2O2S
InChI: InChI=1/C18H22N2O2S/c1-18(2,3)13-8-6-9-14(12-13)22-17(23)20(4)15-10-7-11-16(19-15)21-5/h6-12H,1-5H3
45 atoms
S  -2.20465 1.280932 1.660088
O  -0.513782 0.269933 -0.0952
O  0.129683 -5.37303 0.859238
N  -1.841086 -1.224044 0.864183
N  -0.815548 -3.293499 0.792253
C  2.994181 3.63417 -0.471012
C  1.569763 3.185102 -0.776289
C  3.166172 3.778298 1.046518
C  3.327428 4.977698 -1.11966
C  3.981059 2.58684 -1.003979
C  1.112286 1.967882 -0.267456
C  0.689325 3.934135 -1.547512
C  -0.167201 1.529195 -0.532495
C  -0.600431 3.484445 -1.803848
C  -1.04358 2.276419 -1.302932
C  -1.511724 0.084336 0.777856
C  -1.221714 -2.241343 0.095622
C  -2.791392 -1.631063 1.887876
C  -1.113848 -2.16715 -1.282345
C  -0.511316 -3.238206 -1.932356
C  -0.266743 -4.308583 0.163142
C  -0.071469 -4.331794 -1.220388
C  -0.069835 -5.361858 2.259696
H  2.470971 4.513902 1.452989
H  2.993412 2.838439 1.571676
H  4.180278 4.104852 1.285887
H  2.678868 5.778636 -0.760996
H  4.352964 5.260235 -0.877551
H  3.250727 4.938448 -2.207563
H  5.009359 2.892219 -0.800323
H  3.833815 1.610361 -0.541755
H  3.876013 2.460176 -2.082396
H  1.754892 1.342695 0.339796
H  0.995164 4.88294 -1.964319
H  -1.266891 4.088129 -2.405456
H  -2.048252 1.926824 -1.498049
H  -3.719332 -1.075582 1.770588
H  -2.40274 -1.437096 2.886438
H  -2.985545 -2.692923 1.782537
H  -1.48668 -1.321986 -1.839502
H  -0.401075 -3.215968 -3.008371
H  0.393985 -5.181708 -1.698244
H  0.320933 -6.309401 2.622349
H  -1.126758 -5.284061 2.521065
H  0.461949 -4.540422 2.742131
totalener: -1357.39649818 hartree
nucrepener: 2043.49644708 hartree
electener: -3400.89294525 hartree
oneelecener: -5914.00163982 hartree
twoeener: 2513.10869456 hartree
kineticenergy: 1352.53927181 hartree
xcener: -113.291582206054 hartree
chargesum: -0.0000000
charge: -0.333658 -0.284656 -0.276168 -0.062202 -0.381870 0.252051 -0.013730 -0.288302 -0.334489 -0.291408 -0.146599 -0.157047 0.172151 -0.115234 -0.131201 0.245261 0.226058 -0.158432 -0.192486 -0.069679 0.358435 -0.199156 -0.115950 0.102652 0.088902 0.085930 0.096162 0.090102 0.094858 0.087036 0.087899 0.098735 0.097958 0.116720 0.120569 0.115080 0.113618 0.116510 0.091006 0.119133 0.128557 0.126069 0.119508 0.097038 0.104272
qa: -0.3337 -0.2847 -0.2762 -0.0622 -0.3819 0.2521 -0.0137 -0.2883 -0.3345 -0.2914 -0.1466 -0.1570 0.1722 -0.1152 -0.1312 0.2453 0.2261 -0.1584 -0.1925 -0.0697 0.3584 -0.1992 -0.1160 0.1027 0.0889 0.0859 0.0962 0.0901 0.0949 0.0870 0.0879 0.0987 0.0980 0.1167 0.1206 0.1151 0.1136 0.1165 0.0910 0.1191 0.1286 0.1261 0.1195 0.0970 0.1043
va: 2.0829 2.0852 2.1224 3.2224 2.9811 3.7535 3.7167 3.9261 3.9280 3.9223 4.1704 3.9496 3.8913 4.0164 4.0463 4.2526 4.0156 3.8863 3.9604 3.9524 4.0413 3.9403 3.8877 1.0068 1.0071 1.0052 1.0027 1.0122 1.0027 1.0065 1.0077 1.0064 1.0266 1.0078 1.0036 1.0135 1.0084 1.0022 1.0124 1.0135 0.9992 1.0119 0.9941 0.9963 0.9983
dispcorr: -0.021099709 hartree
energy: -1357.417597883838
dipole: 20.06028 -19.57566 0.48462 13.86316 -14.69424 -0.83107 -0.91168 0.22641 -0.68527
magnitude: 1.18115 au
magnitude: 3.00226 debye
