program: Orca
programVersion: 5.0.2
elementType: S O O N N C C C C C C C C C C C C C C C C C C H H H H H H H H H H H H H H H H H H H H H H
charge: 0
multiplicity: 1
keywords: wb97x-d3
keywords: def2-TZVPP
keywords: def2/J RIJCOSX
keywords: DEFGRID2
keywords: scfconv7
keywords: smallprint printgap noloewdin
keywords: NOSOSCF
formula: C18H22N2O2S
InChI: InChI=1/C18H22N2O2S/c1-18(2,3)13-8-6-9-14(12-13)22-17(23)20(4)15-10-7-11-16(19-15)21-5/h6-12H,1-5H3
45 atoms
S  0.755203 0.545966 2.767329
O  -0.722645 0.38275 0.586221
O  -0.821156 -4.926804 -1.322943
N  -0.575036 -1.504714 1.73595
N  -0.750884 -3.193891 0.164658
C  2.440741 3.401768 -1.604137
C  1.142158 3.19198 -0.834027
C  2.667574 4.868845 -1.968746
C  2.401341 2.586214 -2.90306
C  3.617177 2.933794 -0.736583
C  0.78781 1.903605 -0.439367
C  0.283855 4.231769 -0.489782
C  -0.370175 1.679789 0.275072
C  -0.881631 3.99381 0.22609
C  -1.220508 2.712422 0.621702
C  -0.207681 -0.206782 1.673196
C  -1.332177 -2.139952 0.719092
C  -0.011155 -2.343197 2.780771
C  -2.604433 -1.716413 0.384896
C  -3.272392 -2.427241 -0.606601
C  -1.397719 -3.865419 -0.761857
C  -2.678164 -3.517088 -1.202037
C  0.469574 -5.29255 -0.874455
H  1.872509 5.261929 -2.604911
H  2.742558 5.503987 -1.084621
H  3.603566 4.970752 -2.519681
H  2.300835 1.516724 -2.715172
H  1.564539 2.889458 -3.533758
H  3.321444 2.731747 -3.472589
H  4.562018 3.072619 -1.265843
H  3.665988 3.498603 0.194977
H  3.540766 1.878537 -0.473792
H  1.41839 1.057159 -0.680789
H  0.513384 5.248125 -0.776783
H  -1.530189 4.821111 0.482002
H  -2.121564 2.517544 1.187436
H  -0.449361 -3.333533 2.706686
H  -0.235037 -1.918877 3.757179
H  1.070723 -2.423563 2.684138
H  -3.064649 -0.872932 0.876047
H  -4.269211 -2.12818 -0.902248
H  -3.172557 -4.094069 -1.970225
H  0.751609 -6.162667 -1.461489
H  0.474135 -5.554144 0.18479
H  1.197476 -4.495931 -1.031746
totalener: -1357.39679803 hartree
nucrepener: 2057.76690568 hartree
electener: -3415.16370372 hartree
oneelecener: -5942.66967156 hartree
twoeener: 2527.50596784 hartree
kineticenergy: 1352.55462055 hartree
xcener: -113.292224944341 hartree
chargesum: 0.0000000
charge: -0.336752 -0.286660 -0.276043 -0.064602 -0.374894 0.252484 -0.007467 -0.335220 -0.291892 -0.284285 -0.122914 -0.159927 0.159370 -0.110709 -0.145325 0.244436 0.212765 -0.156878 -0.188323 -0.065671 0.354564 -0.193141 -0.116547 0.094894 0.095717 0.090333 0.087219 0.099098 0.086853 0.084712 0.102644 0.089720 0.099950 0.115581 0.120312 0.110968 0.089975 0.113748 0.115208 0.119470 0.127911 0.127366 0.119751 0.098403 0.103796
qa: -0.3368 -0.2867 -0.2760 -0.0646 -0.3749 0.2525 -0.0075 -0.3352 -0.2919 -0.2843 -0.1229 -0.1599 0.1594 -0.1107 -0.1453 0.2444 0.2128 -0.1569 -0.1883 -0.0657 0.3546 -0.1931 -0.1165 0.0949 0.0957 0.0903 0.0872 0.0991 0.0869 0.0847 0.1026 0.0897 0.1000 0.1156 0.1203 0.1110 0.0900 0.1137 0.1152 0.1195 0.1279 0.1274 0.1198 0.0984 0.1038
va: 2.0769 2.1009 2.1227 3.2128 2.9815 3.7575 3.6987 3.9292 3.9225 3.9243 4.1427 3.9479 3.8979 4.0019 4.0894 4.2498 4.0160 3.8913 3.9541 3.9480 4.0463 3.9358 3.8859 1.0026 1.0029 1.0121 1.0078 1.0065 1.0065 1.0054 1.0076 1.0087 1.0190 1.0084 1.0029 1.0083 1.0102 1.0081 1.0024 1.0160 0.9993 1.0114 0.9938 0.9973 0.9988
dispcorr: -0.021365841 hartree
energy: -1357.418163875488
dipole: 16.80452 -17.34793 -0.54341 12.18973 -12.78886 -0.59914 -13.11389 12.29595 -0.81794
magnitude: 1.15034 au
magnitude: 2.92394 debye
