program: Orca
programVersion: 5.0.2
elementType: S O O N N C C C C C C C C C C C C C C C C C C H H H H H H H H H H H H H H H H H H H H H H
charge: 0
multiplicity: 1
keywords: wb97x-d3
keywords: def2-TZVPP
keywords: def2/J RIJCOSX
keywords: DEFGRID2
keywords: scfconv7
keywords: smallprint printgap noloewdin
keywords: NOSOSCF
formula: C18H22N2O2S
InChI: InChI=1/C18H22N2O2S/c1-18(2,3)13-8-6-9-14(12-13)22-17(23)20(4)15-10-7-11-16(19-15)21-5/h6-12H,1-5H3
45 atoms
S  -2.898922 1.169222 -1.064076
O  -1.067815 0.477267 0.725666
O  1.474786 -3.475652 -0.055267
N  -2.489467 -1.115586 0.218321
N  -0.48249 -2.307723 0.127729
C  3.215495 2.185936 -0.817469
C  1.821154 2.461882 -0.265114
C  3.097859 1.478205 -2.173433
C  3.974262 1.285411 0.166321
C  4.024835 3.467474 -1.01516
C  0.951473 1.393333 -0.049344
C  1.363761 3.735702 0.052901
C  -0.30998 1.59913 0.46897
C  0.090323 3.931592 0.574183
C  -0.763274 2.865933 0.792552
C  -2.126043 0.159829 -0.029983
C  -1.575842 -2.022845 0.82158
C  -3.664468 -1.670728 -0.426392
C  -1.873943 -2.594601 2.040404
C  -0.968404 -3.521944 2.551812
C  0.370375 -3.174254 0.625263
C  0.174077 -3.825619 1.8493
C  1.684542 -2.837225 -1.299636
H  2.564072 0.529887 -2.097175
H  2.562989 2.096127 -2.895656
H  4.088371 1.26353 -2.580104
H  3.475825 0.326216 0.312874
H  4.981701 1.078841 -0.200966
H  4.063976 1.760438 1.14414
H  3.548435 4.147536 -1.723067
H  4.178296 4.004348 -0.077635
H  5.011069 3.224237 -1.412989
H  1.246789 0.376212 -0.274915
H  1.996609 4.59881 -0.09801
H  -0.239723 4.934251 0.811612
H  -1.754684 3.013601 1.195627
H  -4.51924 -1.013991 -0.281774
H  -3.876946 -2.640738 0.016614
H  -3.508739 -1.793434 -1.499225
H  -2.770642 -2.319971 2.576852
H  -1.158451 -3.99601 3.505513
H  0.901056 -4.536985 2.214227
H  0.866724 -3.019961 -1.997857
H  2.60478 -3.25769 -1.697706
H  1.801207 -1.756901 -1.189577
totalener: -1357.39346258 hartree
nucrepener: 2109.48235700 hartree
electener: -3466.87581958 hartree
oneelecener: -6046.02497745 hartree
twoeener: 2579.14915786 hartree
kineticenergy: 1352.54719596 hartree
xcener: -113.288563590985 hartree
chargesum: -0.0000000
charge: -0.344701 -0.278234 -0.276503 -0.096264 -0.352358 0.250882 -0.026592 -0.290087 -0.292395 -0.333934 -0.084671 -0.144814 0.119765 -0.116553 -0.111448 0.263091 0.184466 -0.158825 -0.188538 -0.067153 0.353505 -0.179631 -0.079053 0.081205 0.104709 0.086759 0.086531 0.086778 0.100786 0.097851 0.093529 0.090351 0.065151 0.117242 0.119626 0.116858 0.110968 0.093768 0.119745 0.134529 0.130555 0.128323 0.109541 0.121424 0.053816
qa: -0.3447 -0.2782 -0.2765 -0.0963 -0.3524 0.2509 -0.0266 -0.2901 -0.2924 -0.3339 -0.0847 -0.1448 0.1198 -0.1166 -0.1114 0.2631 0.1845 -0.1588 -0.1885 -0.0672 0.3535 -0.1796 -0.0791 0.0812 0.1047 0.0868 0.0865 0.0868 0.1008 0.0979 0.0935 0.0904 0.0652 0.1172 0.1196 0.1169 0.1110 0.0938 0.1197 0.1345 0.1306 0.1283 0.1095 0.1214 0.0538
va: 2.0756 2.1206 2.1286 3.1736 3.0179 3.7382 3.7023 3.9321 3.9294 3.9287 4.1177 3.9037 3.9564 4.0161 4.0188 4.2674 4.0273 3.8785 3.9581 3.9524 4.0326 3.9298 3.9049 1.0049 1.0077 1.0054 1.0029 1.0059 1.0072 1.0025 1.0031 1.0118 1.0052 1.0067 1.0030 1.0178 1.0103 1.0000 1.0021 1.0088 0.9989 1.0118 1.0042 0.9936 0.9866
dispcorr: -0.022885854 hartree
energy: -1357.416348434139
dipole: 23.76612 -23.13520 0.63092 6.00626 -7.09433 -1.08808 -7.17032 7.83829 0.66796
magnitude: 1.42413 au
magnitude: 3.61985 debye
