program: Orca
programVersion: 5.0.2
elementType: S O O N N C C C C C C C C C C C C C C C C C C H H H H H H H H H H H H H H H H H H H H H H
charge: 0
multiplicity: 1
keywords: wb97x-d3
keywords: def2-TZVPP
keywords: def2/J RIJCOSX
keywords: DEFGRID2
keywords: scfconv7
keywords: smallprint printgap noloewdin
keywords: NOSOSCF
formula: C18H22N2O2S
InChI: InChI=1/C18H22N2O2S/c1-18(2,3)13-8-6-9-14(12-13)22-17(23)20(4)15-10-7-11-16(19-15)21-5/h6-12H,1-5H3
45 atoms
S  -1.111769 0.096849 -2.485145
O  -0.301059 -0.062514 0.04035
O  0.339282 -4.316849 2.093187
N  -2.060297 -1.28257 -0.429091
N  -0.867991 -2.802355 0.88234
C  1.764096 4.201587 -1.261949
C  1.899225 2.758301 -0.790176
C  0.899892 4.990365 -0.26978
C  1.09769 4.205887 -2.644848
C  3.117244 4.903143 -1.376687
C  0.744955 2.000509 -0.598827
C  3.126834 2.143925 -0.560655
C  0.831468 0.678156 -0.214209
C  3.201029 0.816502 -0.160784
C  2.051746 0.06621 0.009527
C  -1.145777 -0.42882 -0.931071
C  -1.846767 -1.911298 0.829013
C  -3.112007 -1.806546 -1.279259
C  -2.664635 -1.612453 1.897664
C  -2.434111 -2.295578 3.090224
C  -0.648686 -3.428549 2.016009
C  -1.415675 -3.216204 3.168618
C  1.124689 -4.53118 0.935436
H  0.796816 6.027582 -0.595296
H  -0.104871 4.577981 -0.179181
H  1.346557 4.994026 0.72543
H  0.114008 3.736214 -2.628235
H  0.972025 5.228584 -3.00683
H  1.703062 3.662872 -3.371731
H  2.972691 5.931391 -1.711201
H  3.64068 4.94345 -0.419929
H  3.770686 4.41724 -2.102812
H  -0.232153 2.434481 -0.762088
H  4.047329 2.695324 -0.689658
H  4.167736 0.362377 0.013895
H  2.090294 -0.970745 0.3158
H  -3.825369 -2.341292 -0.656695
H  -2.71294 -2.487871 -2.031849
H  -3.620843 -0.994386 -1.79356
H  -3.442686 -0.868259 1.808568
H  -3.048281 -2.094282 3.957712
H  -1.202333 -3.761057 4.077095
H  1.865611 -5.276352 1.213226
H  1.62994 -3.619555 0.611746
H  0.529046 -4.902448 0.100326
totalener: -1357.39424785 hartree
nucrepener: 2074.98204652 hartree
electener: -3432.37629437 hartree
oneelecener: -5977.20328982 hartree
twoeener: 2544.82699545 hartree
kineticenergy: 1352.55290875 hartree
xcener: -113.289477598951 hartree
chargesum: -0.0000000
charge: -0.351374 -0.276997 -0.274346 -0.093532 -0.344641 0.252199 -0.024096 -0.293413 -0.277865 -0.335438 -0.095683 -0.149360 0.142278 -0.140146 -0.139308 0.264766 0.167309 -0.156646 -0.178235 -0.066446 0.346820 -0.175263 -0.111657 0.086179 0.087555 0.097776 0.090119 0.084207 0.099238 0.089979 0.096035 0.093288 0.099849 0.114824 0.118199 0.120317 0.094388 0.120185 0.110666 0.131749 0.130127 0.128558 0.119412 0.092620 0.105804
qa: -0.3514 -0.2770 -0.2743 -0.0935 -0.3446 0.2522 -0.0241 -0.2934 -0.2779 -0.3354 -0.0957 -0.1494 0.1423 -0.1401 -0.1393 0.2648 0.1673 -0.1566 -0.1782 -0.0664 0.3468 -0.1753 -0.1117 0.0862 0.0876 0.0978 0.0901 0.0842 0.0992 0.0900 0.0960 0.0933 0.0998 0.1148 0.1182 0.1203 0.0944 0.1202 0.1107 0.1317 0.1301 0.1286 0.1194 0.0926 0.1058
va: 2.0638 2.1247 2.1277 3.1607 3.0239 3.7627 3.7326 3.9244 3.9252 3.9287 4.0569 3.9359 3.9300 4.0291 4.0435 4.2605 4.0354 3.8762 3.9630 3.9517 4.0491 3.9259 3.8943 1.0068 1.0081 1.0063 1.0116 1.0058 1.0078 1.0123 1.0025 1.0032 1.0307 1.0082 1.0045 0.9901 1.0003 1.0018 1.0106 1.0105 0.9994 1.0118 0.9933 0.9875 0.9997
dispcorr: -0.021977048 hartree
energy: -1357.416224895181
dipole: 9.84867 -10.13227 -0.28361 21.00256 -21.45595 -0.45340 -5.07552 6.23754 1.16202
magnitude: 1.27918 au
magnitude: 3.25141 debye
