program: Gaussian 09
title: 000007508
version: EM64L-G09RevD.01
frameworkgroup: C1[X(C7H10O)]
method: RPBEPBE
basis: SDD
operation: Freq
keyword: #pfreq=noraman
keyword: PBEPBE/SDD
title: #p freq=noraman PBEPBE/SDD
converged: NO YES NO NO
title: Mulliken charges:
elementType: O C C C C C C C H H H H H H H H H H
charge: -0.180161 -0.123973 -0.465660 -0.460473 -0.423724 -0.179415 -0.193646 -0.100318 0.234823 0.224944 0.206340 0.244300 0.213252 0.213337 0.218751 0.202936 0.206118 0.162568
chargesum: 0.00000
title: Mulliken charges with hydrogens summed into heavy atoms:
elementType: O C C C C C C C
charge: -0.180161 0.110850 -0.034376 -0.002921 0.008365 0.023521 0.012472 0.062250
polarizability: 7.13038843e+01 4.84104262e+00 7.74656690e+01 3.40280663e+00 2.66604805e+00 6.38093411e+01
1716.lowfreq: -24.8366 -14.0814 -5.1314 0.0008 0.0010 0.0010 71.7186 100.8844 176.6274
frequency: 71.6057 100.8160 176.5944 260.2596 332.8873 378.9465 477.2055 524.2389 594.0881 670.7273 739.0833 770.6954 854.9249 879.4688 917.2488 930.8305 960.2026 976.2552 992.6492 1057.1996 1074.5871 1108.7099 1131.8776 1173.8729 1194.0742 1236.3793 1260.9869 1311.4490 1331.0824 1338.5904 1348.5791 1378.5706 1391.0428 1447.3355 1459.9647 1466.4748 1643.8046 1680.3127 2836.2398 2935.4123 2948.4908 2974.2620 2987.2523 3014.4721 3021.0890 3048.3432 3097.7288 3129.5029
redmass: 5.3593 2.5350 2.2017 2.9500 2.1149 1.9255 4.4271 3.8001 2.6930 1.3716 2.2094 2.3495 2.8819 1.9574 2.0849 2.3413 1.7466 1.2233 2.6197 1.8788 1.6715 1.4846 1.2025 1.1794 1.0999 1.3090 1.4210 1.7634 1.4367 1.4947 1.5974 1.4808 1.2981 1.0903 1.0798 1.0919 8.7103 6.4322 1.0840 1.0792 1.0664 1.0623 1.0638 1.0918 1.0981 1.1019 1.0840 1.0994
irintensity: 4.9229 2.8432 2.8707 8.7250 0.9526 0.2509 5.3679 0.0650 5.6660 52.9283 12.2888 4.4683 6.5731 1.8482 10.0151 18.6792 5.9834 0.7118 1.1499 3.6808 3.7464 0.3800 0.3709 4.2499 5.7521 2.4829 4.0117 6.0164 2.2250 2.0935 2.9689 0.7346 1.2627 16.5380 14.3155 7.2591 130.1620 4.5775 118.9556 24.3631 33.4581 40.1267 47.4974 42.0369 9.2713 41.4043 7.8783 52.4159
temp: 298.150 k
press: 1.00000 atm
elementType: 8 6 6 6 6 6 6 6 1 1 1 1 1 1 1 1 1 1
symmnumber: 1
zpe: 398574.3 jmol-1
zpe.correction: 0.151809 hartree
zpe.thermalcorrener: 0.159455 hartree
zpe.thermalcorrenthalpy: 0.160399 hartree
zpe.thermalcorrgfe: 0.119526 hartree
zpe.sumelectzpe: -347.317072 hartree
zpe.sumelectthermal: -347.309426 hartree
zpe.sumelectthermalent: -347.308482 hartree
zpe.sumelectthermalfe: -347.349355 hartree
dipole: -1.6908 -1.7557 1.9369
dipole: 3.1134
quadrupole: -53.5238 -45.3202 -48.8546
quadrupole: -2.6758 5.5101 1.4810
quadrupole: -4.2909 3.9126 0.3783 -2.6758 5.5101 1.4810
hfenergy: -347.468881 hartree
pointgroup: C01 [X(C7H10O1)]
dipole: -0.6653369 -0.804808 0.6403041 debye
dipolederiv: -0.5938149 -0.1282598 0.1902952 -0.2230993 -0.5693955 0.1482389 0.283613 0.1146578 -0.4634551 -0.1093601 -0.0606856 0.1649341 -0.0743176 -0.0364965 -0.0265494 0.3285604 0.0007037 -0.1489508 0.1200542 -0.0200644 -0.0291456 0.0313358 0.1003657 -0.0447693 -0.0155884 -0.0058222 0.0742406 -0.0114863 0.0118822 -0.0612241 -0.043114 0.0027165 0.0109398 -0.1244518 -0.0190193 0.0919059 0.1051141 0.0670959 -0.0766489 0.0442588 -0.0190794 0.0176882 -0.1009425 -0.046243 0.0852952 0.0506347 -0.0311177 0.2090466 -0.0581812 0.0358508 -0.0241106 0.2262723 -0.0033243 -0.0643256 -0.1009312 -0.1249576 0.0976213 -0.0935345 0.1482097 0.0412182 0.1266756 0.0446162 -0.123198 0.6236178 0.0967082 -0.4239088 0.085629 0.740174 -0.028963 -0.6166394 -0.0867446 0.5219373 -0.0448441 0.0430428 -0.0776797 0.0789854 0.0606696 0.0363716 -0.1022812 0.0611572 -0.0442759 -0.0440569 -0.0391957 0.1003947 -0.0139554 0.0850614 -0.0082829 0.0802761 0.0375131 -0.0980655 0.0232965 0.1249559 -0.0204748 0.0806345 -0.1787877 -0.006323 -0.0108412 -0.0434725 0.0655993 -0.0149333 -0.1175568 -0.0561268 -0.0638465 -0.0109621 0.0132163 -0.009968 0.0451248 0.1018815 0.0299136 0.0317108 0.0474643 0.0685066 0.0802325 0.0092883 0.0184201 -0.0607181 -0.1690455 -0.1115957 -0.1221286 -0.045828 -0.1077594 -0.0383274 -0.026783 -0.0340973 0.0181405 0.0880559 0.0314024 0.0872341 0.130486 0.0218124 0.0011296 -0.050347 0.0805301 -0.0306663 -0.0965398 0.0479126 0.076264 -0.0534932 0.0979616 -0.1401264 -0.000959 -0.0601559 0.0030583 0.115592 -0.0273006 0.0791006 -0.1456001 0.0712284 0.0129559 0.0339004 -0.1492262 0.042409 0.038157 0.0263771 0.0259716 0.0498879 0.0974555 -0.2741906 -0.0937744 0.0798441 -0.0713704 0.0251914 unknown
polarizability: 70.8739504|4.0668168|76.6723597|4.110062|4.6466747|65.0325843 unknown
InChI: InChI=1S/C7H10O/c8-6-7-4-2-1-3-5-7/h1-2,6-7H,3-5H2
charge 0 multiplicity 1
18 atoms
O  2.304441 0.497646 -0.769783
C  0.644939 -0.409634 0.833873
C  -0.493564 -1.43069 0.544474
C  0.101694 1.020241 1.058991
C  -1.320275 -1.016173 -0.694717
C  -1.056161 1.360163 0.136942
C  -1.687025 0.457133 -0.658359
C  1.702368 -0.479255 -0.267932
H  1.17777 -0.750828 1.751125
H  -1.155197 -1.469915 1.430046
H  -0.071352 -2.44576 0.406459
H  0.922331 1.745139 0.889877
H  -0.214151 1.145437 2.114738
H  -2.238029 -1.633173 -0.755264
H  -0.750976 -1.232908 -1.624609
H  -1.374747 2.41151 0.12052
H  -2.497584 0.790681 -1.320442
H  1.938218 -1.526312 -0.602339
