program: Orca
programVersion: 4.2.1
elementType: Cl Cl S O N N N C C C C C C C C C C C C C C H H H H H H H H H H H H H H H
charge: 0
multiplicity: 1
keywords: wb97x-d3
keywords: def2-TZVPP
keywords: def2/J RIJCOSX GRIDX6 NOFINALGRIDX
keywords: grid4 nofinalgrid
keywords: scfconv7
keywords: smallprint printgap noloewdin
keywords: NOSOSCF
formula: C14H15Cl2N3OS
InChI: InChI=1/C14H15Cl2N3OS/c15-11-4-2-1-3-10(11)7-14(20,13(16)5-6-13)8-19-12(21)17-9-18-19/h1-4,9,18,20H,5-8H2
36 atoms
Cl -1.32218 -2.928122 -0.493627
Cl 2.786486 -0.148391 2.556219
S  -1.690053 2.833514 -0.108276
O  -0.002269 0.450809 1.155069
N  -1.883298 0.425751 -1.27825
N  -2.8337 -0.354298 -1.834911
N  -3.79876 1.496736 -1.21027
C  -1.126294 -1.578005 0.653287
C  -1.246928 -1.928825 2.093461
C  -2.349239 -1.174698 1.405767
C  -0.093432 -0.55191 0.181626
C  -0.494975 0.027045 -1.18807
C  1.287222 -1.23565 0.061945
C  2.40904 -0.260717 -0.138183
C  3.120224 0.30972 0.916605
C  2.781579 0.117395 -1.427946
C  -2.486198 1.568504 -0.880363
C  -3.964863 0.322056 -1.771561
C  4.138378 1.228196 0.703195
C  3.791847 1.03667 -1.662108
C  4.469255 1.598796 -0.590608
H  -0.610502 -1.397069 2.78888
H  -1.423214 -2.965304 2.347387
H  -3.26822 -1.704462 1.193105
H  -2.481696 -0.125872 1.640697
H  -0.309567 -0.687686 -1.987735
H  0.100549 0.912893 -1.413154
H  1.277416 -1.94438 -0.766737
H  1.450078 -1.823388 0.966589
H  -0.446839 1.266528 0.850681
H  -2.647357 -1.299109 -2.143722
H  2.267492 -0.329079 -2.270681
H  -4.890118 -0.079418 -2.151733
H  4.672044 1.650975 1.543511
H  4.051149 1.306719 -2.676834
H  5.261689 2.316452 -0.754833
elementType: Cl S O N C H
totalener: -2100.67052842 hartree
nucrepener: 2213.95643666 hartree
electener: -4314.62696508 hartree
oneelecener: -7288.30130333 hartree
twoeener: 2973.67433825 hartree
cpcmener: -0.05043735 hartree
kineticenergy: 2095.28917405 hartree
xcener: -137.608314891125 hartree
chargesum: -0.0000000
charge: -0.154632 -0.100210 -0.496115 -0.439630 0.084225 -0.052379 -0.371538 -0.026096 -0.169713 -0.179540 0.542620 -0.328794 -0.199653 0.099499 -0.022609 -0.207417 0.135557 0.171303 -0.154142 -0.161151 -0.169603 0.092556 0.104299 0.108131 0.092237 0.163694 0.151206 0.125357 0.120969 0.202243 0.229215 0.151052 0.194370 0.138206 0.162866 0.163616
qa: -0.1546 -0.1002 -0.4961 -0.4396 0.0842 -0.0524 -0.3715 -0.0261 -0.1697 -0.1795 0.5426 -0.3288 -0.1997 0.0995 -0.0226 -0.2074 0.1356 0.1713 -0.1541 -0.1612 -0.1696 0.0926 0.1043 0.1081 0.0922 0.1637 0.1512 0.1254 0.1210 0.2022 0.2292 0.1511 0.1944 0.1382 0.1629 0.1636
va: 1.1797 1.2227 1.9056 1.9882 3.1675 3.4125 3.0108 3.8919 3.9516 3.9120 3.4603 3.9164 3.7321 3.4080 3.9490 3.8872 4.3597 3.9999 3.9757 3.9187 3.9242 1.0388 1.0317 1.0316 1.0408 0.9945 1.0218 1.0275 1.0232 1.1195 1.0002 0.9987 0.9793 1.0090 0.9889 0.9872
dispcorr: -0.023598484 hartree
energy: -2100.694126904770
dipole: 0.70888 -1.11415 -0.40527 -0.52809 -3.06117 -3.58927 -5.59628 2.62651 -2.96977
magnitude: 4.67617 au
magnitude: 11.88588 debye
