program: Orca
programVersion: 4.2.1
elementType: Cl Cl S O N N N C C C C C C C C C C C C C C H H H H H H H H H H H H H H H
charge: 0
multiplicity: 1
keywords: wb97x-d3
keywords: def2-TZVPP
keywords: def2/J RIJCOSX GRIDX6 NOFINALGRIDX
keywords: grid4 nofinalgrid
keywords: scfconv7
keywords: smallprint printgap noloewdin
keywords: NOSOSCF
formula: C14H15Cl2N3OS
InChI: InChI=1/C14H15Cl2N3OS/c15-11-4-2-1-3-10(11)7-14(20,13(16)5-6-13)8-19-12(21)17-9-18-19/h1-4,9,18,20H,5-8H2
36 atoms
Cl -0.826689 -2.444331 1.100159
Cl 3.09842 1.515725 -1.540595
S  -2.477837 2.372621 -1.436942
O  0.195093 1.176048 -0.215034
N  -2.440617 -0.289897 -1.08075
N  -3.287452 -1.267027 -0.692702
N  -4.40822 0.60084 -0.683693
C  -0.548447 -0.683215 1.053505
C  -0.09139 -0.071605 2.33155
C  -1.499955 0.138361 1.862986
C  -0.039983 -0.201485 -0.306897
C  -1.05641 -0.543958 -1.415589
C  1.281672 -0.880117 -0.720452
C  2.441216 -0.512885 0.155293
C  3.29113 0.560227 -0.10475
C  2.704437 -1.265113 1.300157
C  -3.134854 0.870195 -1.05984
C  -4.452904 -0.692792 -0.465522
C  4.339595 0.887643 0.744928
C  3.743143 -0.953759 2.161035
C  4.560433 0.133006 1.885568
H  0.602465 0.755302 2.269611
H  0.075019 -0.733381 3.17076
H  -2.295405 -0.380485 2.381218
H  -1.775101 1.116691 1.488333
H  -0.978952 -1.593103 -1.695268
H  -0.825103 0.032904 -2.312022
H  1.48303 -0.605885 -1.757894
H  1.155846 -1.963166 -0.71136
H  -0.556844 1.672008 -0.596196
H  -2.993408 -2.227053 -0.5724
H  2.072428 -2.117538 1.515991
H  -5.312311 -1.257156 -0.14191
H  4.982499 1.726351 0.514916
H  3.914281 -1.559223 3.040884
H  5.376139 0.390713 2.54762
elementType: Cl S O N C H
totalener: -2100.67078849 hartree
nucrepener: 2221.66166060 hartree
electener: -4322.33244909 hartree
oneelecener: -7303.74664000 hartree
twoeener: 2981.41419091 hartree
cpcmener: -0.05054212 hartree
kineticenergy: 2095.29031966 hartree
xcener: -137.610266476060 hartree
chargesum: -0.0000000
charge: -0.151851 -0.100420 -0.493015 -0.434517 0.084519 -0.043290 -0.371170 -0.027783 -0.174492 -0.204221 0.518454 -0.270613 -0.202055 0.105016 0.004620 -0.209116 0.129770 0.168382 -0.161623 -0.165535 -0.167957 0.100140 0.108669 0.109132 0.093038 0.153052 0.141058 0.106671 0.127369 0.198505 0.228336 0.143546 0.195489 0.137911 0.161904 0.162079
qa: -0.1519 -0.1004 -0.4930 -0.4345 0.0845 -0.0433 -0.3712 -0.0278 -0.1745 -0.2042 0.5185 -0.2706 -0.2021 0.1050 0.0046 -0.2091 0.1298 0.1684 -0.1616 -0.1655 -0.1680 0.1001 0.1087 0.1091 0.0930 0.1531 0.1411 0.1067 0.1274 0.1985 0.2283 0.1435 0.1955 0.1379 0.1619 0.1621
va: 1.1872 1.2232 1.9101 1.9941 3.1607 3.4176 3.0044 3.8585 3.9315 3.9346 3.5993 3.8864 3.7739 3.3711 3.9195 3.8633 4.3690 3.9999 3.9804 3.9285 3.9214 1.0273 1.0311 1.0340 1.0460 0.9959 1.0300 1.0385 1.0269 1.1248 0.9958 1.0123 0.9787 1.0093 0.9891 0.9875
dispcorr: -0.024326668 hartree
energy: -2100.695115156899
dipole: 1.39836 -1.73298 -0.33461 -5.24053 0.39570 -4.84483 9.23216 -8.24604 0.98612
magnitude: 4.95548 au
magnitude: 12.59583 debye
