program: Orca
programVersion: 4.2.1
elementType: Cl Cl S O N N N C C C C C C C C C C C C C C H H H H H H H H H H H H H H H
charge: 0
multiplicity: 1
keywords: wb97x-d3
keywords: def2-TZVPP
keywords: def2/J RIJCOSX GRIDX6 NOFINALGRIDX
keywords: grid4 nofinalgrid
keywords: scfconv7
keywords: smallprint printgap noloewdin
keywords: NOSOSCF
formula: C14H15Cl2N3OS
InChI: InChI=1/C14H15Cl2N3OS/c15-11-4-2-1-3-10(11)7-14(20,13(16)5-6-13)8-19-12(21)17-9-18-19/h1-4,9,18,20H,5-8H2
36 atoms
Cl -1.205686 -2.711954 0.250496
Cl 2.681192 -1.578337 -1.574116
S  -1.984002 2.879152 0.033807
O  -0.23866 0.848762 1.773494
N  -1.687483 0.412737 -0.956185
N  -2.345401 -0.443989 -1.78487
N  -3.569652 1.369189 -1.589039
C  -1.20235 -1.26291 1.29788
C  -1.536329 -1.503936 2.728379
C  -2.533634 -0.842618 1.82314
C  -0.13428 -0.23645 0.903925
C  -0.31266 0.188735 -0.567289
C  1.266317 -0.84903 1.105252
C  2.384182 0.02706 0.61323
C  3.074967 -0.20931 -0.57415
C  2.769642 1.145363 1.353831
C  -2.428836 1.545696 -0.853449
C  -3.496431 0.174644 -2.083312
C  4.096699 0.620684 -1.011797
C  3.784647 1.985668 0.931601
C  4.45017 1.724261 -0.256174
H  -1.031224 -0.890819 3.462825
H  -1.725161 -2.522836 3.037671
H  -3.398263 -1.41752 1.519479
H  -2.719179 0.217193 1.943514
H  0.098581 -0.564137 -1.237994
H  0.235783 1.117294 -0.744696
H  1.3155 -1.829947 0.635886
H  1.3855 -1.013605 2.178698
H  -0.739205 1.58163 1.358926
H  -2.192786 -1.4378 -1.666492
H  2.253482 1.352922 2.280544
H  -4.252811 -0.302123 -2.689391
H  4.609376 0.399746 -1.937618
H  4.055369 2.844529 1.530587
H  5.24593 2.3732 -0.596133
totalener: -2100.64586922 hartree
nucrepener: 2218.57520816 hartree
electener: -4319.22107737 hartree
oneelecener: -7297.13433157 hartree
twoeener: 2977.91325420 hartree
kineticenergy: 2095.31644980 hartree
xcener: -137.608780089689 hartree
chargesum: 0.0000000
charge: -0.153614 -0.097397 -0.357965 -0.405965 0.082171 -0.114989 -0.276047 -0.023999 -0.157278 -0.165090 0.577204 -0.423463 -0.232006 0.012554 0.057446 -0.138799 0.130825 0.125991 -0.145463 -0.148290 -0.107231 0.094530 0.095170 0.089226 0.095106 0.151784 0.161908 0.123791 0.109328 0.194553 0.191259 0.122527 0.154697 0.119379 0.129245 0.128902
qa: -0.1536 -0.0974 -0.3580 -0.4060 0.0822 -0.1150 -0.2760 -0.0240 -0.1573 -0.1651 0.5772 -0.4235 -0.2320 0.0126 0.0574 -0.1388 0.1308 0.1260 -0.1455 -0.1483 -0.1072 0.0945 0.0952 0.0892 0.0951 0.1518 0.1619 0.1238 0.1093 0.1946 0.1913 0.1225 0.1547 0.1194 0.1292 0.1289
va: 1.1930 1.2336 2.0756 2.0199 3.1417 3.2968 3.0269 3.8688 3.9556 3.9263 3.4015 3.9899 3.7970 3.4425 3.9066 4.0009 4.3466 4.0288 4.0499 3.9952 3.9551 1.0397 1.0320 1.0341 1.0490 1.0146 1.0126 1.0372 1.0212 1.1359 1.0449 1.0296 0.9893 1.0136 1.0004 0.9983
dispcorr: -0.023623328 hartree
energy: -2100.669492543331
dipole: 0.85059 -0.54046 0.31013 5.52407 -7.39293 -1.86886 10.42434 -10.90140 -0.47705
magnitude: 1.95356 au
magnitude: 4.96556 debye
