program: Orca
programVersion: 4.2.1
elementType: Cl Cl O O N N N C C C C C C C C C C C C C C C H H H H H H H H H H H H H H H H H
charge: 0
multiplicity: 1
keywords: wb97x-d3
keywords: def2-TZVPP
keywords: def2/J RIJCOSX GRIDX6 NOFINALGRIDX
keywords: grid4 nofinalgrid
keywords: scfconv7
keywords: smallprint printgap noloewdin
keywords: NOSOSCF
formula: C15H17Cl2N3O2
InChI: InChI=1/C15H17Cl2N3O2/c1-2-3-12-7-21-15(22-12,8-20-10-18-9-19-20)13-5-4-11(16)6-14(13)17/h4-6,9-10,12H,2-3,7-8H2,1H3
39 atoms
Cl 1.229748 0.189152 -2.401639
Cl 5.807752 -0.279789 0.283356
O  -0.845941 -0.649413 -0.483653
O  -0.705049 -0.047482 1.665401
N  -1.985167 1.882267 -0.154566
N  -2.83737 2.151677 0.837831
N  -3.940364 1.90587 -1.102709
C  -0.216645 0.243803 0.392401
C  -1.506185 -1.675726 0.263067
C  -0.983041 -1.438266 1.673894
C  -3.014849 -1.548332 0.135918
C  -0.576377 1.696133 0.053233
C  1.302737 0.085076 0.332107
C  -3.75672 -2.74947 0.709457
C  2.017972 0.05812 -0.864327
C  2.035501 0.005894 1.512117
C  -5.26605 -2.578383 0.630031
C  3.399792 -0.052333 -0.889468
C  3.415016 -0.113859 1.51765
C  -2.657612 1.723588 -1.295037
C  4.086223 -0.141681 0.308774
C  -3.98996 2.156368 0.219397
H  -1.178696 -2.645417 -0.122217
H  -1.710654 -1.641692 2.458478
H  -0.080286 -2.023854 1.877817
H  -3.273421 -1.437705 -0.920757
H  -3.349502 -0.636287 0.640703
H  -0.061485 2.014851 -0.850442
H  -0.244317 2.351063 0.857087
H  -3.468767 -2.908378 1.75288
H  -3.458663 -3.653702 0.171316
H  1.520368 0.03892 2.461749
H  -5.596312 -1.715526 1.211214
H  -5.594587 -2.425343 -0.399587
H  -5.788589 -3.454324 1.015731
H  3.928775 -0.066516 -1.832062
H  3.950556 -0.180478 2.453981
H  -2.175343 1.501347 -2.233703
H  -4.909684 2.360909 0.744507
elementType: Cl O N C H
totalener: -1817.03580760 hartree
nucrepener: 2167.62871582 hartree
electener: -3984.66452342 hartree
oneelecener: -6800.64940929 hartree
twoeener: 2815.98488587 hartree
cpcmener: -0.02754677 hartree
kineticenergy: 1811.92411740 hartree
xcener: -128.818222313860 hartree
chargesum: 0.0000000
charge: -0.075657 -0.084284 -0.380435 -0.380630 0.140879 -0.357817 -0.405198 0.598305 0.193684 -0.024496 -0.166387 -0.165261 -0.062892 -0.091178 -0.084677 -0.146258 -0.275914 -0.135646 -0.177353 0.069790 0.107439 0.051334 0.090261 0.111953 0.104439 0.075630 0.054987 0.152909 0.134938 0.060595 0.065286 0.155579 0.079222 0.079618 0.092727 0.123071 0.147802 0.162280 0.161355
qa: -0.0757 -0.0843 -0.3804 -0.3806 0.1409 -0.3578 -0.4052 0.5983 0.1937 -0.0245 -0.1664 -0.1653 -0.0629 -0.0912 -0.0847 -0.1463 -0.2759 -0.1356 -0.1774 0.0698 0.1074 0.0513 0.0903 0.1120 0.1044 0.0756 0.0550 0.1529 0.1349 0.0606 0.0653 0.1556 0.0792 0.0796 0.0927 0.1231 0.1478 0.1623 0.1614
va: 1.2446 1.2196 2.0144 2.0018 3.3378 2.8721 3.0215 3.8330 3.8950 3.9454 3.9356 3.8106 3.5787 3.8869 4.0596 3.9219 3.9376 4.0630 4.0437 4.0667 3.8633 4.0430 0.9987 1.0017 0.9974 1.0196 1.0179 1.0096 1.0249 1.0120 1.0096 1.0183 1.0018 1.0008 1.0041 1.0244 1.0063 1.0048 0.9976
dispcorr: -0.022322887 hartree
energy: -1817.058130486914
dipole: -39.12360 40.15824 1.03465 -13.56588 12.42778 -1.13810 11.42562 -10.72817 0.69745
magnitude: 1.68884 au
magnitude: 4.29270 debye
