program: Orca
programVersion: 4.2.1
elementType: Cl Cl O O N N N C C C C C C C C C C C C C C C H H H H H H H H H H H H H H H H H
charge: 0
multiplicity: 1
keywords: wb97x-d3
keywords: def2-TZVPP
keywords: def2/J RIJCOSX GRIDX6 NOFINALGRIDX
keywords: grid4 nofinalgrid
keywords: scfconv7
keywords: smallprint printgap noloewdin
keywords: NOSOSCF
formula: C15H17Cl2N3O2
InChI: InChI=1/C15H17Cl2N3O2/c1-2-3-12-7-21-15(22-12,8-20-10-18-9-19-20)13-5-4-11(16)6-14(13)17/h4-6,9-10,12H,2-3,7-8H2,1H3
39 atoms
Cl 0.581349 1.985542 1.182409
Cl 5.069126 -0.133999 -0.705878
O  -1.323191 -1.816313 -0.320786
O  -1.497548 -0.011114 0.96218
N  -1.383587 1.659488 -1.443441
N  -0.331108 2.180826 -2.0799
N  -1.4963 3.790404 -1.035972
C  -0.95658 -0.465411 -0.235017
C  -1.516336 -2.325264 1.004081
C  -1.331059 -1.078845 1.878661
C  -2.889739 -2.962593 1.101925
C  -1.637162 0.244276 -1.408083
C  0.568574 -0.335059 -0.288836
C  -3.100901 -3.700646 2.417708
C  1.307613 0.696374 0.287681
C  1.277964 -1.29328 -1.011072
C  -4.474571 -4.347908 2.499964
C  2.68988 0.757535 0.168495
C  2.652986 -1.250821 -1.154778
C  -2.056831 2.627055 -0.819455
C  3.350164 -0.217824 -0.55392
C  -0.442551 3.453132 -1.802755
H  -0.7428 -3.06876 1.220431
H  -2.080733 -0.979305 2.663115
H  -0.340686 -1.051356 2.344406
H  -3.01135 -3.667482 0.274156
H  -3.657376 -2.191161 0.977556
H  -2.713733 0.089226 -1.33285
H  -1.300933 -0.188915 -2.348384
H  -2.976146 -3.013153 3.259594
H  -2.328327 -4.466245 2.533443
H  0.743502 -2.106107 -1.481921
H  -4.62106 -5.071035 1.695664
H  -4.609305 -4.875475 3.44469
H  -5.269516 -3.6041 2.422203
H  3.23919 1.564046 0.633357
H  3.16468 -2.01342 -1.724455
H  -2.949883 2.44373 -0.243793
H  0.2637 4.174627 -2.18259
elementType: Cl O N C H
totalener: -1817.03353610 hartree
nucrepener: 2185.48143711 hartree
electener: -4002.51497321 hartree
oneelecener: -6836.88810652 hartree
twoeener: 2834.37313331 hartree
cpcmener: -0.02874886 hartree
kineticenergy: 1811.93379255 hartree
xcener: -128.819382257215 hartree
chargesum: 0.0000000
charge: -0.074346 -0.084967 -0.413201 -0.370171 0.096208 -0.347028 -0.404028 0.607559 0.170606 -0.010932 -0.177105 -0.075173 -0.062347 -0.085288 -0.069008 -0.193215 -0.284186 -0.105217 -0.174658 0.063974 0.096117 0.057480 0.094242 0.113259 0.098926 0.072730 0.075214 0.129075 0.130774 0.060965 0.063790 0.146505 0.081381 0.091678 0.080612 0.119822 0.147949 0.171731 0.160271
qa: -0.0743 -0.0850 -0.4132 -0.3702 0.0962 -0.3470 -0.4040 0.6076 0.1706 -0.0109 -0.1771 -0.0752 -0.0623 -0.0853 -0.0690 -0.1932 -0.2842 -0.1052 -0.1747 0.0640 0.0961 0.0575 0.0942 0.1133 0.0989 0.0727 0.0752 0.1291 0.1308 0.0610 0.0638 0.1465 0.0814 0.0917 0.0806 0.1198 0.1479 0.1717 0.1603
va: 1.2422 1.2195 1.9743 1.9906 3.3674 2.8708 3.0211 3.7957 3.8361 3.9247 3.9648 3.8568 3.5233 3.8661 3.9705 4.0188 3.9432 4.0283 4.0203 4.0734 3.8677 4.0563 1.0033 0.9990 1.0031 1.0179 1.0119 1.0149 1.0123 1.0114 1.0090 1.0243 1.0003 1.0032 1.0007 1.0255 1.0051 0.9999 0.9970
dispcorr: -0.022065711 hartree
energy: -1817.055601809303
dipole: -35.10825 34.03852 -1.06972 -28.47216 25.88004 -2.59212 10.72525 -9.96253 0.76272
magnitude: 2.90605 au
magnitude: 7.38659 debye
