program: Orca
programVersion: 4.2.1
elementType: Cl Cl O O N N N C C C C C C C C C C C C C C C H H H H H H H H H H H H H H H H H
charge: 0
multiplicity: 1
keywords: wb97x-d3
keywords: def2-TZVPP
keywords: def2/J RIJCOSX GRIDX6 NOFINALGRIDX
keywords: grid4 nofinalgrid
keywords: scfconv7
keywords: smallprint printgap noloewdin
keywords: NOSOSCF
formula: C15H17Cl2N3O2
InChI: InChI=1/C15H17Cl2N3O2/c1-2-3-12-7-21-15(22-12,8-20-10-18-9-19-20)13-5-4-11(16)6-14(13)17/h4-6,9-10,12H,2-3,7-8H2,1H3
39 atoms
Cl 1.659869 2.222394 1.075717
Cl 5.625299 -1.124598 -0.128243
O  -1.019691 -1.01385 -0.574437
O  -0.729347 0.511612 1.054619
N  -1.950724 1.628036 -1.205311
N  -2.928652 0.992743 -1.85759
N  -3.78352 2.547744 -0.482405
C  -0.288244 0.118833 -0.219019
C  -1.662549 -1.548145 0.579722
C  -1.813252 -0.313148 1.450344
C  -2.968102 -2.201457 0.18312
C  -0.577175 1.206278 -1.267298
C  1.20767 -0.171546 -0.172499
C  -3.723377 -2.755579 1.385479
C  2.136251 0.706238 0.386066
C  1.698711 -1.347985 -0.728757
C  -5.009998 -3.45566 0.977548
C  3.492909 0.421916 0.40512
C  3.048544 -1.658521 -0.722861
C  -2.477276 2.536923 -0.382258
C  3.935767 -0.766023 -0.149636
C  -4.000477 1.580274 -1.395028
H  -1.003683 -2.280575 1.063521
H  -2.772193 0.190929 1.277857
H  -1.724187 -0.525804 2.515304
H  -2.766886 -3.011502 -0.523582
H  -3.588106 -1.466536 -0.33983
H  -0.3651 0.826404 -2.26513
H  0.05413 2.078547 -1.110497
H  -3.959751 -1.946882 2.08352
H  -3.083073 -3.453849 1.931845
H  1.013972 -2.050331 -1.181695
H  -5.682371 -2.774724 0.452713
H  -4.809385 -4.297306 0.312424
H  -5.545004 -3.841682 1.845579
H  4.190207 1.119633 0.847372
H  3.394347 -2.583784 -1.161362
H  -1.878842 3.175376 0.247817
H  -4.985739 1.304289 -1.736466
elementType: Cl O N C H
totalener: -1817.03578158 hartree
nucrepener: 2154.40090292 hartree
electener: -3971.43668450 hartree
oneelecener: -6774.16722489 hartree
twoeener: 2802.73054039 hartree
cpcmener: -0.02643468 hartree
kineticenergy: 1811.92879432 hartree
xcener: -128.818850484036 hartree
chargesum: 0.0000000
charge: -0.075709 -0.084145 -0.402509 -0.387084 0.145126 -0.364778 -0.411680 0.593081 0.200783 -0.027672 -0.184119 -0.149067 -0.059056 -0.084693 -0.072073 -0.131437 -0.286961 -0.140233 -0.179540 0.062287 0.109801 0.061653 0.094251 0.085098 0.119981 0.081585 0.068243 0.131527 0.149718 0.064970 0.068400 0.152565 0.080081 0.081710 0.092594 0.123917 0.147885 0.162541 0.162959
qa: -0.0757 -0.0841 -0.4025 -0.3871 0.1451 -0.3648 -0.4117 0.5931 0.2008 -0.0277 -0.1841 -0.1491 -0.0591 -0.0847 -0.0721 -0.1314 -0.2870 -0.1402 -0.1795 0.0623 0.1098 0.0617 0.0943 0.0851 0.1200 0.0816 0.0682 0.1315 0.1497 0.0650 0.0684 0.1526 0.0801 0.0817 0.0926 0.1239 0.1479 0.1625 0.1630
va: 1.2442 1.2199 2.0010 1.9866 3.3502 2.8918 3.0251 3.8211 3.7776 3.9680 3.9715 3.8328 3.5928 3.8684 4.0541 3.9200 3.9503 4.0660 4.0458 4.0618 3.8616 4.0288 1.0033 0.9908 0.9955 1.0117 1.0155 1.0246 1.0145 1.0079 1.0080 1.0218 1.0001 1.0003 1.0028 1.0239 1.0063 1.0065 0.9967
dispcorr: -0.021839126 hartree
energy: -1817.057620703408
dipole: -40.94520 41.50612 0.56092 -19.46071 18.30647 -1.15425 2.71692 -2.33725 0.37967
magnitude: 1.33831 au
magnitude: 3.40171 debye
