program: Orca
programVersion: 4.2.1
elementType: Cl Cl O O N N N C C C C C C C C C C C C C C C H H H H H H H H H H H H H H H H H
charge: 0
multiplicity: 1
keywords: wb97x-d3
keywords: def2-TZVPP
keywords: def2/J RIJCOSX GRIDX6 NOFINALGRIDX
keywords: grid4 nofinalgrid
keywords: scfconv7
keywords: smallprint printgap noloewdin
keywords: NOSOSCF
formula: C15H17Cl2N3O2
InChI: InChI=1/C15H17Cl2N3O2/c1-2-3-12-7-21-15(22-12,8-20-10-18-9-19-20)13-5-4-11(16)6-14(13)17/h4-6,9-10,12H,2-3,7-8H2,1H3
39 atoms
Cl 0.490651 -1.317108 -2.317341
Cl 4.775967 0.667875 0.147846
O  -1.656776 -1.363813 -0.285025
O  -1.758388 0.209059 1.277018
N  -1.284064 2.212495 -0.877989
N  -0.260765 2.613469 -1.637923
N  -0.696714 4.13118 -0.043488
C  -1.224611 -0.073922 0.016029
C  -1.772507 -2.096323 0.935876
C  -1.690137 -1.002784 2.014303
C  -3.079457 -2.867759 0.930162
C  -1.83954 0.889441 -1.003846
C  0.299527 0.047502 0.043587
C  -3.237038 -3.803842 2.125968
C  1.12726 -0.462126 -0.95336
C  0.907875 0.773413 1.063682
C  -2.255282 -4.967283 2.137841
C  2.502318 -0.284197 -0.926549
C  2.276384 0.973377 1.114237
C  -1.518955 3.117727 0.073312
C  3.064158 0.434276 0.113603
C  0.049582 3.763615 -1.102172
H  -0.922388 -2.779901 1.021091
H  -2.526144 -1.021143 2.713916
H  -0.761485 -1.067871 2.587827
H  -3.144826 -3.452835 0.008061
H  -3.907631 -2.152891 0.912512
H  -2.918654 0.93183 -0.857403
H  -1.650476 0.543963 -2.017075
H  -4.255219 -4.198264 2.114288
H  -3.150215 -3.239746 3.059586
H  0.301615 1.205337 1.847431
H  -1.220859 -4.638803 2.246224
H  -2.464351 -5.643854 2.967103
H  -2.321142 -5.54742 1.215589
H  3.12119 -0.695672 -1.711439
H  2.712308 1.542733 1.922763
H  -2.301096 3.012232 0.807748
H  0.847761 4.371272 -1.498291
elementType: Cl O N C H
totalener: -1817.03284849 hartree
nucrepener: 2194.17205604 hartree
electener: -4011.20490453 hartree
oneelecener: -6854.04376470 hartree
twoeener: 2842.83886017 hartree
cpcmener: -0.02696328 hartree
kineticenergy: 1811.93392055 hartree
xcener: -128.819340034531 hartree
chargesum: -0.0000000
charge: -0.075573 -0.084852 -0.381371 -0.389318 0.109778 -0.335100 -0.407111 0.581064 0.128958 -0.008625 -0.161500 -0.082264 -0.104244 -0.103744 -0.033651 -0.165549 -0.275563 -0.137434 -0.192112 0.058540 0.117410 0.058160 0.097810 0.107037 0.103836 0.075617 0.085868 0.132061 0.131793 0.075047 0.056691 0.159627 0.079801 0.093231 0.082691 0.121155 0.148450 0.171885 0.161499
qa: -0.0756 -0.0849 -0.3814 -0.3893 0.1098 -0.3351 -0.4071 0.5811 0.1290 -0.0086 -0.1615 -0.0823 -0.1042 -0.1037 -0.0337 -0.1655 -0.2756 -0.1374 -0.1921 0.0585 0.1174 0.0582 0.0978 0.1070 0.1038 0.0756 0.0859 0.1321 0.1318 0.0750 0.0567 0.1596 0.0798 0.0932 0.0827 0.1212 0.1484 0.1719 0.1615
va: 1.2442 1.2189 2.0098 1.9712 3.3677 2.8835 3.0290 3.8654 3.8279 3.9117 3.9447 3.8163 3.5553 3.8853 3.9993 3.8756 3.9280 4.0804 4.0772 4.0695 3.8543 4.0450 1.0037 1.0050 0.9956 1.0157 1.0122 1.0217 1.0266 1.0063 1.0130 1.0144 1.0010 1.0032 1.0009 1.0252 1.0051 1.0052 0.9965
dispcorr: -0.022620528 hartree
energy: -1817.055469019276
dipole: -30.14249 28.80661 -1.33588 -20.28987 18.65100 -1.63887 19.19404 -17.65538 1.53866
magnitude: 2.61495 au
magnitude: 6.64667 debye
