program: Orca
programVersion: 4.2.1
elementType: Cl Cl O O N N N C C C C C C C C C C C C C C C H H H H H H H H H H H H H H H H H
charge: 0
multiplicity: 1
keywords: wb97x-d3
keywords: def2-TZVPP
keywords: def2/J RIJCOSX GRIDX6 NOFINALGRIDX
keywords: grid4 nofinalgrid
keywords: scfconv7
keywords: smallprint printgap noloewdin
keywords: NOSOSCF
formula: C15H17Cl2N3O2
InChI: InChI=1/C15H17Cl2N3O2/c1-2-3-12-7-21-15(22-12,8-20-10-18-9-19-20)13-5-4-11(16)6-14(13)17/h4-6,9-10,12H,2-3,7-8H2,1H3
39 atoms
Cl 0.677757 -0.833253 -2.132261
Cl 5.546358 -0.893763 0.02123
O  -1.129098 -0.438808 0.178392
O  -0.556708 0.986828 1.8142
N  -2.045721 2.048144 -0.447389
N  -2.661192 2.76707 0.497035
N  -4.166213 1.739365 -0.815518
C  -0.289428 0.623074 0.484786
C  -1.521706 -1.078754 1.385663
C  -1.483814 0.074425 2.377918
C  -2.891344 -1.707378 1.25313
C  -0.62836 1.80802 -0.433343
C  1.18131 0.240508 0.339308
C  -2.989516 -2.913358 0.323682
C  1.682783 -0.420898 -0.781851
C  2.088016 0.559032 1.345649
C  -2.909735 -2.591106 -1.162588
C  3.019627 -0.773938 -0.887522
C  3.429256 0.224322 1.264384
C  -2.954248 1.429248 -1.202973
C  3.882131 -0.449601 0.144699
C  -3.922656 2.555513 0.228673
H  -0.782482 -1.84467 1.656523
H  -2.464341 0.552778 2.477671
H  -1.144608 -0.235287 3.366786
H  -3.607913 -0.93656 0.949108
H  -3.184375 -2.01763 2.260775
H  -0.305137 1.620851 -1.455532
H  -0.113481 2.702704 -0.088194
H  -3.943467 -3.408496 0.521743
H  -2.216037 -3.640465 0.58946
H  1.74448 1.081567 2.226257
H  -3.647264 -1.833972 -1.43919
H  -1.930004 -2.217038 -1.455063
H  -3.114887 -3.480604 -1.7605
H  3.378269 -1.295608 -1.763889
H  4.102914 0.484732 2.068498
H  -2.689276 0.788258 -2.028361
H  -4.705996 3.016949 0.809295
elementType: Cl O N C H
totalener: -1817.03286432 hartree
nucrepener: 2202.70323939 hartree
electener: -4019.73610370 hartree
oneelecener: -6870.74725361 hartree
twoeener: 2851.01114990 hartree
cpcmener: -0.02513870 hartree
kineticenergy: 1811.93780312 hartree
xcener: -128.820889692039 hartree
chargesum: -0.0000000
charge: -0.082568 -0.084148 -0.354756 -0.400769 0.150683 -0.364189 -0.417123 0.564213 0.164231 -0.010085 -0.154440 -0.125725 -0.069239 -0.093648 -0.025815 -0.144261 -0.272873 -0.152122 -0.177260 0.062877 0.112001 0.060236 0.082653 0.080843 0.108295 0.060514 0.096382 0.146460 0.130874 0.072816 0.054077 0.150292 0.070951 0.072787 0.097769 0.125302 0.146981 0.156727 0.161056
qa: -0.0826 -0.0841 -0.3548 -0.4008 0.1507 -0.3642 -0.4171 0.5642 0.1642 -0.0101 -0.1544 -0.1257 -0.0692 -0.0936 -0.0258 -0.1443 -0.2729 -0.1521 -0.1773 0.0629 0.1120 0.0602 0.0827 0.0808 0.1083 0.0605 0.0964 0.1465 0.1309 0.0728 0.0541 0.1503 0.0710 0.0728 0.0978 0.1253 0.1470 0.1567 0.1611
va: 1.2339 1.2200 1.9987 1.9650 3.3358 2.8906 2.9900 3.8387 3.8434 3.9813 3.9400 3.8236 3.5668 3.8903 3.9923 3.9531 3.9368 4.0790 4.0432 4.0734 3.8580 4.0395 1.0061 1.0012 1.0015 1.0195 1.0118 1.0138 1.0233 1.0052 1.0085 1.0252 1.0041 1.0128 1.0064 1.0236 1.0067 1.0040 0.9960
dispcorr: -0.023729464 hartree
energy: -1817.056593782323
dipole: -31.25089 32.11412 0.86322 -7.62260 6.77776 -0.84484 8.99553 -8.25130 0.74423
magnitude: 1.41873 au
magnitude: 3.60612 debye
