program: Orca
programVersion: 4.2.1
elementType: Cl Cl O O N N N C C C C C C C C C C C C C C C H H H H H H H H H H H H H H H H H
charge: 0
multiplicity: 1
keywords: wb97x-d3
keywords: def2-TZVPP
keywords: def2/J RIJCOSX GRIDX6 NOFINALGRIDX
keywords: grid4 nofinalgrid
keywords: scfconv7
keywords: smallprint printgap noloewdin
keywords: NOSOSCF
formula: C15H17Cl2N3O2
InChI: InChI=1/C15H17Cl2N3O2/c1-2-3-12-7-21-15(22-12,8-20-10-18-9-19-20)13-5-4-11(16)6-14(13)17/h4-6,9-10,12H,2-3,7-8H2,1H3
39 atoms
Cl 0.491379 1.97653 1.281807
Cl 4.977176 -0.110789 -0.658746
O  -1.436209 -1.747441 -0.359224
O  -1.61443 0.023847 0.956207
N  -1.323396 1.719333 -1.498075
N  -2.016686 2.669398 -0.863636
N  -0.229057 3.555111 -1.892793
C  -1.052818 -0.406309 -0.240079
C  -1.49561 -2.303253 0.956517
C  -1.464094 -1.057054 1.860748
C  -2.745055 -3.151739 1.087024
C  -1.684467 0.329384 -1.425736
C  0.475216 -0.293658 -0.262946
C  -2.780527 -3.932047 2.395251
C  1.218319 0.713392 0.351699
C  1.180947 -1.232589 -1.014125
C  -4.025253 -4.797548 2.5152
C  2.601707 0.770227 0.2384
C  2.556592 -1.19489 -1.149424
C  -0.259722 2.261582 -2.095156
C  3.257969 -0.186385 -0.51258
C  -1.322664 3.744112 -1.129644
H  -0.60845 -2.92228 1.130172
H  -2.286959 -1.020344 2.574982
H  -0.524045 -0.982546 2.415255
H  -2.783596 -3.855506 0.25046
H  -3.629784 -2.511402 1.007245
H  -2.769115 0.256269 -1.362655
H  -1.368305 -0.152664 -2.349947
H  -2.736034 -3.244803 3.245539
H  -1.888761 -4.561437 2.46594
H  0.641978 -2.024217 -1.515333
H  -4.933389 -4.193087 2.484774
H  -4.083584 -5.52074 1.699878
H  -4.032468 -5.355754 3.451721
H  3.153594 1.559223 0.729962
H  3.065933 -1.94198 -1.741336
H  0.440717 1.687077 -2.681284
H  -1.624616 4.713533 -0.765584
elementType: Cl O N C H
totalener: -1817.03331469 hartree
nucrepener: 2187.53254531 hartree
electener: -4004.56586000 hartree
oneelecener: -6840.71855680 hartree
twoeener: 2836.15269680 hartree
cpcmener: -0.03211694 hartree
kineticenergy: 1811.92797228 hartree
xcener: -128.818059259726 hartree
chargesum: -0.0000000
charge: -0.069192 -0.082452 -0.407358 -0.365448 0.105040 -0.340366 -0.398797 0.587035 0.145541 -0.003080 -0.161252 -0.064129 -0.137570 -0.084113 -0.024559 -0.166648 -0.286711 -0.107689 -0.178855 0.038283 0.104264 0.053153 0.091317 0.109199 0.097811 0.073698 0.074774 0.120537 0.140662 0.061153 0.064823 0.147254 0.080777 0.081446 0.091909 0.120539 0.148807 0.179925 0.160271
qa: -0.0692 -0.0825 -0.4074 -0.3654 0.1050 -0.3404 -0.3988 0.5870 0.1455 -0.0031 -0.1613 -0.0641 -0.1376 -0.0841 -0.0246 -0.1666 -0.2867 -0.1077 -0.1789 0.0383 0.1043 0.0532 0.0913 0.1092 0.0978 0.0737 0.0748 0.1205 0.1407 0.0612 0.0648 0.1473 0.0808 0.0814 0.0919 0.1205 0.1488 0.1799 0.1603
va: 1.2496 1.2219 1.9784 1.9934 3.3692 2.8711 3.0172 3.8765 3.8307 3.8998 3.9609 3.8215 3.5720 3.8648 3.9410 3.9855 3.9440 4.0480 4.0368 4.0863 3.8721 4.0618 1.0043 0.9988 1.0015 1.0163 1.0113 1.0302 1.0025 1.0105 1.0090 1.0234 1.0006 1.0002 1.0031 1.0261 1.0047 0.9897 0.9964
dispcorr: -0.022316156 hartree
energy: -1817.055630844621
dipole: -31.85831 31.74091 -0.11740 -30.33073 27.49633 -2.83441 9.42491 -9.34984 0.07507
magnitude: 2.83783 au
magnitude: 7.21319 debye
