program: Orca
programVersion: 4.2.1
elementType: Cl Cl O O N N N C C C C C C C C C C C C C C C H H H H H H H H H H H H H H H H H
charge: 0
multiplicity: 1
keywords: wb97x-d3
keywords: def2-TZVPP
keywords: def2/J RIJCOSX GRIDX6 NOFINALGRIDX
keywords: grid4 nofinalgrid
keywords: scfconv7
keywords: smallprint printgap noloewdin
keywords: NOSOSCF
formula: C15H17Cl2N3O2
InChI: InChI=1/C15H17Cl2N3O2/c1-2-3-12-7-21-15(22-12,8-20-10-18-9-19-20)13-5-4-11(16)6-14(13)17/h4-6,9-10,12H,2-3,7-8H2,1H3
39 atoms
Cl 1.713593 2.421336 0.730244
Cl 5.459702 -1.168383 -0.470781
O  -1.168266 -0.967478 -0.014786
O  -0.732561 0.824851 1.220805
N  -2.222821 1.42243 -1.118205
N  -2.666495 2.518137 -0.497175
N  -4.386582 1.297529 -1.26597
C  -0.410915 0.203383 0.018171
C  -1.404037 -1.405707 1.324527
C  -0.913783 -0.21408 2.164041
C  -2.86724 -1.745233 1.538852
C  -0.82858 1.077648 -1.16519
C  1.081917 -0.114855 -0.081591
C  -3.351416 -3.033772 0.880291
C  2.081931 0.808815 0.219252
C  1.488248 -1.369949 -0.52522
C  -3.404257 -3.027243 -0.641391
C  3.42757 0.493321 0.105652
C  2.824028 -1.711959 -0.650757
C  -3.255934 0.703317 -1.556996
C  3.785117 -0.771163 -0.327513
C  -3.962022 2.398882 -0.616594
H  -0.791462 -2.290371 1.530403
H  -1.641978 0.11687 2.904584
H  0.021467 -0.447564 2.681845
H  -3.484737 -0.894953 1.229732
H  -3.007683 -1.849556 2.618185
H  -0.633403 0.536362 -2.089649
H  -0.247896 1.996016 -1.198079
H  -4.353581 -3.244532 1.261974
H  -2.723401 -3.86281 1.221112
H  0.742043 -2.107831 -0.783466
H  -3.855567 -3.94956 -1.011534
H  -4.01037 -2.198011 -1.01205
H  -2.416904 -2.947558 -1.093528
H  4.182086 1.22747 0.351643
H  3.103179 -2.697713 -0.995466
H  -3.137823 -0.218759 -2.102275
H  -4.634384 3.144786 -0.222677
elementType: Cl O N C H
totalener: -1817.03333642 hartree
nucrepener: 2179.41650410 hartree
electener: -3996.44984052 hartree
oneelecener: -6824.16880841 hartree
twoeener: 2827.71896789 hartree
cpcmener: -0.02867607 hartree
kineticenergy: 1811.94049037 hartree
xcener: -128.819462397263 hartree
chargesum: -0.0000000
charge: -0.074774 -0.083585 -0.377800 -0.358044 0.144436 -0.356166 -0.424774 0.562534 0.122018 0.034376 -0.174262 -0.095822 -0.139723 -0.095710 -0.018566 -0.131895 -0.278962 -0.156357 -0.198293 0.048514 0.124963 0.056968 0.090289 0.099846 0.091912 0.077685 0.090769 0.141799 0.134834 0.072082 0.054544 0.160603 0.098660 0.071961 0.079468 0.121834 0.147307 0.174960 0.162370
qa: -0.0748 -0.0836 -0.3778 -0.3580 0.1444 -0.3562 -0.4248 0.5625 0.1220 0.0344 -0.1743 -0.0958 -0.1397 -0.0957 -0.0186 -0.1319 -0.2790 -0.1564 -0.1983 0.0485 0.1250 0.0570 0.0903 0.0998 0.0919 0.0777 0.0908 0.1418 0.1348 0.0721 0.0545 0.1606 0.0987 0.0720 0.0795 0.1218 0.1473 0.1750 0.1624
va: 1.2453 1.2205 1.9893 2.0004 3.3602 2.8884 2.9922 3.9207 3.8417 3.9237 3.9358 3.7768 3.5466 3.8943 4.0015 3.9481 3.9377 4.0855 4.0641 4.0610 3.8421 4.0528 1.0003 0.9972 1.0007 1.0126 1.0119 1.0054 1.0297 1.0058 1.0086 1.0081 1.0063 1.0024 1.0079 1.0263 1.0068 0.9924 0.9952
dispcorr: -0.022841800 hartree
energy: -1817.056178218709
dipole: -34.86888 35.76978 0.90089 -20.24517 18.18513 -2.06005 2.75325 -2.54913 0.20411
magnitude: 2.25767 au
magnitude: 5.73853 debye
