program: Orca
programVersion: 4.2.1
elementType: Cl Cl O O N N N C C C C C C C C C C C C C C C H H H H H H H H H H H H H H H H H
charge: 0
multiplicity: 1
keywords: wb97x-d3
keywords: def2-TZVPP
keywords: def2/J RIJCOSX GRIDX6 NOFINALGRIDX
keywords: grid4 nofinalgrid
keywords: scfconv7
keywords: smallprint printgap noloewdin
keywords: NOSOSCF
formula: C15H17Cl2N3O2
InChI: InChI=1/C15H17Cl2N3O2/c1-2-3-12-7-21-15(22-12,8-20-10-18-9-19-20)13-5-4-11(16)6-14(13)17/h4-6,9-10,12H,2-3,7-8H2,1H3
39 atoms
Cl 1.020639 -0.717647 -2.237858
Cl 5.811293 -0.248524 0.043467
O  -0.868554 -0.76308 0.012231
O  -0.565962 0.566313 1.784626
N  -2.044005 1.74341 -0.433772
N  -2.774278 2.348809 0.507062
N  -4.10101 1.481437 -1.083207
C  -0.191375 0.376127 0.454974
C  -1.391997 -1.481587 1.13118
C  -0.811323 -0.722883 2.32035
C  -2.908723 -1.501849 1.10377
C  -0.615973 1.61122 -0.34645
C  1.32148 0.19357 0.32592
C  -3.496725 -2.184169 -0.123416
C  1.934391 -0.287894 -0.830185
C  2.152287 0.552436 1.382707
C  -5.016843 -2.149909 -0.122213
C  3.31073 -0.426425 -0.926185
C  3.52928 0.421501 1.31698
C  -2.847304 1.219064 -1.360004
C  4.096445 -0.073664 0.156793
C  -3.99437 2.16519 0.07275
H  -1.008125 -2.505309 1.095963
H  -1.50452 -0.62667 3.155268
H  0.112287 -1.183805 2.685714
H  -3.293343 -0.479704 1.190867
H  -3.243537 -2.031564 2.001642
H  -0.2228 1.561459 -1.359912
H  -0.202578 2.506659 0.115251
H  -3.14992 -3.221515 -0.160214
H  -3.125835 -1.702469 -1.030968
H  1.719026 0.949543 2.289751
H  -5.382913 -1.121976 -0.143715
H  -5.429224 -2.664596 -0.990902
H  -5.427018 -2.629005 0.769027
H  3.758687 -0.804425 -1.83446
H  4.14263 0.705266 2.160421
H  -2.479007 0.6870 -2.222466
H  -4.846977 2.552282 0.608348
elementType: Cl O N C H
totalener: -1817.03504092 hartree
nucrepener: 2186.35920346 hartree
electener: -4003.39424437 hartree
oneelecener: -6838.15867383 hartree
twoeener: 2834.76442946 hartree
cpcmener: -0.02648195 hartree
kineticenergy: 1811.92410096 hartree
xcener: -128.818034961113 hartree
chargesum: -0.0000000
charge: -0.075121 -0.084675 -0.368648 -0.377434 0.151634 -0.359388 -0.405199 0.595857 0.187130 -0.027772 -0.190777 -0.149377 -0.072148 -0.099287 -0.075148 -0.147774 -0.283402 -0.141215 -0.179264 0.047295 0.111029 0.057775 0.087368 0.106704 0.104260 0.064736 0.094231 0.150023 0.134737 0.073689 0.071422 0.154782 0.073284 0.092387 0.081649 0.122200 0.148023 0.166306 0.160107
qa: -0.0751 -0.0847 -0.3686 -0.3774 0.1516 -0.3594 -0.4052 0.5959 0.1871 -0.0278 -0.1908 -0.1494 -0.0721 -0.0993 -0.0751 -0.1478 -0.2834 -0.1412 -0.1793 0.0473 0.1110 0.0578 0.0874 0.1067 0.1043 0.0647 0.0942 0.1500 0.1347 0.0737 0.0714 0.1548 0.0733 0.0924 0.0816 0.1222 0.1480 0.1663 0.1601
va: 1.2439 1.2194 2.0141 2.0009 3.3349 2.8810 3.0034 3.8496 3.8595 3.9760 3.8977 3.7993 3.5655 3.8430 4.0595 3.9230 3.9389 4.0670 4.0431 4.0683 3.8580 4.0346 0.9993 1.0003 0.9955 1.0141 1.0163 1.0115 1.0234 1.0056 1.0130 1.0190 1.0108 1.0039 1.0017 1.0253 1.0062 1.0007 0.9980
dispcorr: -0.023296345 hartree
energy: -1817.058337260890
dipole: -37.20037 38.32256 1.12220 -8.18538 7.35673 -0.82865 10.78354 -9.95662 0.82692
magnitude: 1.62166 au
magnitude: 4.12193 debye
