program: Orca
programVersion: 4.2.1
elementType: Cl Cl O O N N N C C C C C C C C C C C C C C C H H H H H H H H H H H H H H H H H
charge: 0
multiplicity: 1
keywords: wb97x-d3
keywords: def2-TZVPP
keywords: def2/J RIJCOSX GRIDX6 NOFINALGRIDX
keywords: grid4 nofinalgrid
keywords: scfconv7
keywords: smallprint printgap noloewdin
keywords: NOSOSCF
formula: C15H17Cl2N3O2
InChI: InChI=1/C15H17Cl2N3O2/c1-2-3-12-7-21-15(22-12,8-20-10-18-9-19-20)13-5-4-11(16)6-14(13)17/h4-6,9-10,12H,2-3,7-8H2,1H3
39 atoms
Cl 0.811603 -0.812786 -2.158222
Cl 5.689283 -0.671402 -0.026958
O  -1.018454 -0.487871 0.109814
O  -0.492758 0.888572 1.808001
N  -1.959725 2.033021 -0.432764
N  -2.570135 2.785833 0.488655
N  -4.08188 1.773381 -0.826826
C  -0.204224 0.57846 0.470264
C  -1.543997 -1.106397 1.277494
C  -1.512032 0.028709 2.288583
C  -2.930658 -1.640968 0.998214
C  -0.543208 1.788921 -0.417151
C  1.2762 0.238423 0.328976
C  -2.985198 -2.682126 -0.111256
C  1.80334 -0.376061 -0.806657
C  2.168573 0.573247 1.34284
C  -4.392898 -3.215277 -0.321578
C  3.155356 -0.662069 -0.922636
C  3.523705 0.303221 1.251753
C  -2.872718 1.422608 -1.18993
C  4.004505 -0.319036 0.114407
C  -3.833363 2.600799 0.206845
H  -0.881279 -1.923059 1.591412
H  -2.468189 0.561583 2.331994
H  -1.258404 -0.311202 3.292738
H  -3.593826 -0.804625 0.753636
H  -3.309269 -2.073844 1.929343
H  -0.213471 1.628164 -1.441845
H  -0.032745 2.675447 -0.046136
H  -2.310257 -3.508404 0.127636
H  -2.618296 -2.241594 -1.040881
H  1.803895 1.059371 2.235566
H  -4.777252 -3.691531 0.581202
H  -5.083792 -2.414766 -0.589849
H  -4.423275 -3.954869 -1.122131
H  3.535572 -1.145412 -1.811617
H  4.187045 0.57614 2.060294
H  -2.615802 0.7591 -1.999819
H  -4.613372 3.092179 0.767071
elementType: Cl O N C H
totalener: -1817.03444626 hartree
nucrepener: 2178.70079382 hartree
electener: -3995.73524008 hartree
oneelecener: -6822.73436375 hartree
twoeener: 2826.99912367 hartree
cpcmener: -0.02507310 hartree
kineticenergy: 1811.94649675 hartree
xcener: -128.822159669378 hartree
chargesum: -0.0000000
charge: -0.075760 -0.084465 -0.367888 -0.399619 0.148172 -0.363436 -0.413427 0.579512 0.179717 -0.013540 -0.175196 -0.135281 -0.053051 -0.067857 -0.040889 -0.152207 -0.284594 -0.147165 -0.172649 0.051042 0.108969 0.063836 0.086347 0.078455 0.107923 0.051958 0.098515 0.148076 0.130697 0.061049 0.059822 0.149977 0.080196 0.078820 0.091730 0.123248 0.146917 0.161033 0.161014
qa: -0.0758 -0.0845 -0.3679 -0.3996 0.1482 -0.3634 -0.4134 0.5795 0.1797 -0.0135 -0.1752 -0.1353 -0.0531 -0.0679 -0.0409 -0.1522 -0.2846 -0.1472 -0.1726 0.0510 0.1090 0.0638 0.0863 0.0785 0.1079 0.0520 0.0985 0.1481 0.1307 0.0610 0.0598 0.1500 0.0802 0.0788 0.0917 0.1232 0.1469 0.1610 0.1610
va: 1.2423 1.2197 2.0007 1.9683 3.3453 2.8839 3.0010 3.8303 3.8428 3.9998 3.9248 3.8250 3.5927 3.8513 4.0143 3.9621 3.9484 4.0721 4.0386 4.0846 3.8571 4.0329 1.0044 1.0015 1.0018 1.0218 1.0118 1.0117 1.0239 1.0100 1.0169 1.0255 1.0011 1.0011 1.0036 1.0250 1.0065 1.0052 0.9961
dispcorr: -0.022609870 hartree
energy: -1817.057056133429
dipole: -35.62062 36.35985 0.73922 -9.14065 8.30447 -0.83618 9.93882 -9.27101 0.66780
magnitude: 1.30062 au
magnitude: 3.30591 debye
