program: Orca
programVersion: 4.2.1
elementType: Cl Cl O O N N N C C C C C C C C C C C C C C C H H H H H H H H H H H H H H H H H
charge: 0
multiplicity: 1
keywords: wb97x-d3
keywords: def2-TZVPP
keywords: def2/J RIJCOSX GRIDX6 NOFINALGRIDX
keywords: grid4 nofinalgrid
keywords: scfconv7
keywords: smallprint printgap noloewdin
keywords: NOSOSCF
formula: C15H17Cl2N3O2
InChI: InChI=1/C15H17Cl2N3O2/c1-2-3-12-7-21-15(22-12,8-20-10-18-9-19-20)13-5-4-11(16)6-14(13)17/h4-6,9-10,12H,2-3,7-8H2,1H3
39 atoms
Cl 1.158484 -1.698342 -1.860244
Cl 5.085948 1.422145 -0.075985
O  -0.8516 -1.705847 0.28101
O  -1.208354 0.156812 1.478592
N  -1.412774 1.707213 -0.951158
N  -2.292212 2.463362 -0.288438
N  -0.707085 3.744833 -1.228723
C  -0.685515 -0.314348 0.273947
C  -1.771823 -2.073819 1.312454
C  -2.252067 -0.727007 1.844344
C  -2.87741 -2.952618 0.767236
C  -1.469839 0.26874 -0.922218
C  0.781055 0.071457 0.193966
C  -3.828647 -3.417874 1.864232
C  1.660994 -0.483978 -0.733664
C  1.278907 1.073785 1.022597
C  -4.927786 -4.320965 1.327937
C  2.98503 -0.079485 -0.819265
C  2.593796 1.500408 0.953806
C  -0.472234 2.483534 -1.492074
C  3.439469 0.912437 0.030684
C  -1.829811 3.668821 -0.489765
H  -1.217368 -2.614792 2.087407
H  -3.205231 -0.425652 1.392724
H  -2.362404 -0.7017 2.926865
H  -2.43737 -3.825401 0.277227
H  -3.434067 -2.403297 0.000239
H  -2.517182 -0.028997 -0.873678
H  -1.07418 -0.114381 -1.861287
H  -4.282805 -2.55381 2.358774
H  -3.261755 -3.946788 2.635723
H  0.630057 1.54609 1.745342
H  -4.51228 -5.210531 0.851297
H  -5.592682 -4.654301 2.125182
H  -5.537666 -3.803961 0.58513
H  3.646753 -0.533631 -1.543241
H  2.944337 2.282216 1.61241
H  0.342643 2.096132 -2.083433
H  -2.329613 4.536947 -0.089867
elementType: Cl O N C H
totalener: -1817.03334423 hartree
nucrepener: 2160.50283143 hartree
electener: -3977.53617566 hartree
oneelecener: -6786.44436343 hartree
twoeener: 2808.90818777 hartree
cpcmener: -0.02726768 hartree
kineticenergy: 1811.93124231 hartree
xcener: -128.818865132763 hartree
chargesum: -0.0000000
charge: -0.068856 -0.081961 -0.379313 -0.377608 0.147844 -0.353803 -0.408838 0.569717 0.172650 -0.019367 -0.170034 -0.200054 -0.105831 -0.086765 0.008702 -0.127446 -0.283714 -0.144861 -0.175287 0.045737 0.119559 0.062444 0.090060 0.088159 0.119525 0.072024 0.065838 0.125639 0.152831 0.065179 0.066979 0.149737 0.080708 0.092504 0.080682 0.123197 0.148652 0.171790 0.163580
qa: -0.0689 -0.0820 -0.3793 -0.3776 0.1478 -0.3538 -0.4088 0.5697 0.1726 -0.0194 -0.1700 -0.2001 -0.1058 -0.0868 0.0087 -0.1274 -0.2837 -0.1449 -0.1753 0.0457 0.1196 0.0624 0.0901 0.0882 0.1195 0.0720 0.0658 0.1256 0.1528 0.0652 0.0670 0.1497 0.0807 0.0925 0.0807 0.1232 0.1487 0.1718 0.1636
va: 1.2517 1.2220 2.0191 1.9870 3.3272 2.8907 3.0251 3.8670 3.8906 3.9308 3.9692 3.9083 3.5598 3.8663 3.9893 3.8819 3.9466 4.0879 4.0494 4.0828 3.8625 4.0457 1.0017 1.0022 0.9919 1.0166 1.0099 1.0167 1.0135 1.0088 1.0083 1.0252 1.0007 1.0027 1.0005 1.0247 1.0044 0.9934 0.9945
dispcorr: -0.021669141 hartree
energy: -1817.055013375141
dipole: -40.66097 39.67506 -0.98591 -18.82416 17.18273 -1.64143 14.05207 -13.43843 0.61364
magnitude: 2.01069 au
magnitude: 5.11077 debye
