program: Orca
programVersion: 4.2.1
elementType: Cl Cl O O N N N C C C C C C C C C C C C C C C H H H H H H H H H H H H H H H H H
charge: 0
multiplicity: 1
keywords: wb97x-d3
keywords: def2-TZVPP
keywords: def2/J RIJCOSX GRIDX6 NOFINALGRIDX
keywords: grid4 nofinalgrid
keywords: scfconv7
keywords: smallprint printgap noloewdin
keywords: NOSOSCF
formula: C15H17Cl2N3O2
InChI: InChI=1/C15H17Cl2N3O2/c1-2-3-12-7-21-15(22-12,8-20-10-18-9-19-20)13-5-4-11(16)6-14(13)17/h4-6,9-10,12H,2-3,7-8H2,1H3
39 atoms
Cl 0.787409 -1.963717 -1.485598
Cl 5.057805 1.090125 -0.598758
O  -0.9814 -1.47818 0.800856
O  -1.115963 0.565277 1.703658
N  -1.468643 1.736797 -0.909262
N  -2.227172 2.643248 -0.287028
N  -0.682658 3.65532 -1.56335
C  -0.742029 -0.123336 0.549032
C  -1.903442 -1.603213 1.88816
C  -2.1964 -0.153479 2.270171
C  -3.133373 -2.389175 1.488645
C  -1.602249 0.326299 -0.653755
C  0.728899 0.13196 0.276825
C  -2.840157 -3.826417 1.080007
C  1.473631 -0.62727 -0.624921
C  1.36922 1.208434 0.884896
C  -4.104153 -4.590903 0.719579
C  2.803761 -0.342496 -0.896187
C  2.694206 1.516416 0.62902
C  -0.550389 2.35534 -1.653366
C  3.40274 0.730662 -0.261749
C  -1.721634 3.769717 -0.714939
H  -1.386023 -2.118495 2.704307
H  -3.156874 0.189326 1.868406
H  -2.198899 0.011268 3.346217
H  -3.653814 -1.866962 0.678297
H  -3.816481 -2.384782 2.34456
H  -2.656021 0.11191 -0.476782
H  -1.315769 -0.217696 -1.552157
H  -2.322669 -4.336974 1.897637
H  -2.154339 -3.833663 0.229373
H  0.828589 1.834373 1.579527
H  -3.87999 -5.618928 0.433054
H  -4.799838 -4.627361 1.559914
H  -4.625303 -4.123116 -0.117801
H  3.358808 -0.951583 -1.595702
H  3.158243 2.360448 1.119185
H  0.172512 1.827455 -2.255652
H  -2.124687 4.720855 -0.404619
elementType: Cl O N C H
totalener: -1817.03317237 hartree
nucrepener: 2174.84090200 hartree
electener: -3991.87407437 hartree
oneelecener: -6815.17487786 hartree
twoeener: 2823.30080349 hartree
cpcmener: -0.02735665 hartree
kineticenergy: 1811.93565648 hartree
xcener: -128.819569410985 hartree
chargesum: -0.0000000
charge: -0.069303 -0.082063 -0.372993 -0.372695 0.150345 -0.353451 -0.408882 0.570181 0.167063 -0.004902 -0.183781 -0.209240 -0.104479 -0.069196 0.015094 -0.123261 -0.285450 -0.151727 -0.177830 0.045039 0.122057 0.062568 0.091351 0.083547 0.112652 0.061091 0.084305 0.128678 0.152277 0.059175 0.057579 0.148998 0.091589 0.079982 0.080045 0.122291 0.148247 0.172122 0.162975
qa: -0.0693 -0.0821 -0.3730 -0.3727 0.1503 -0.3535 -0.4089 0.5702 0.1671 -0.0049 -0.1838 -0.2092 -0.1045 -0.0692 0.0151 -0.1233 -0.2854 -0.1517 -0.1778 0.0450 0.1221 0.0626 0.0914 0.0835 0.1127 0.0611 0.0843 0.1287 0.1523 0.0592 0.0576 0.1490 0.0916 0.0800 0.0800 0.1223 0.1482 0.1721 0.1630
va: 1.2511 1.2220 2.0124 1.9878 3.3273 2.8895 3.0241 3.8557 3.8908 3.9524 3.9447 3.9021 3.5331 3.8532 3.9867 3.8783 3.9482 4.0929 4.0527 4.0820 3.8589 4.0457 0.9979 1.0079 0.9975 1.0100 1.0121 1.0165 1.0147 1.0078 1.0203 1.0249 1.0034 1.0009 1.0002 1.0250 1.0048 0.9931 0.9947
dispcorr: -0.021954685 hartree
energy: -1817.055127054909
dipole: -36.80097 35.76493 -1.03603 -16.81366 15.36414 -1.44952 13.52177 -12.69042 0.83135
magnitude: 1.96611 au
magnitude: 4.99746 debye
