program: Orca
programVersion: 4.2.1
elementType: Cl Cl O O N N N C C C C C C C C C C C C C C C H H H H H H H H H H H H H H H H H
charge: 0
multiplicity: 1
keywords: wb97x-d3
keywords: def2-TZVPP
keywords: def2/J RIJCOSX GRIDX6 NOFINALGRIDX
keywords: grid4 nofinalgrid
keywords: scfconv7
keywords: smallprint printgap noloewdin
keywords: NOSOSCF
formula: C15H17Cl2N3O2
InChI: InChI=1/C15H17Cl2N3O2/c1-2-3-12-7-21-15(22-12,8-20-10-18-9-19-20)13-5-4-11(16)6-14(13)17/h4-6,9-10,12H,2-3,7-8H2,1H3
39 atoms
Cl 1.288469 -0.304717 -2.444584
Cl 5.80519 -0.169898 0.375614
O  -0.83428 -0.737478 -0.464301
O  -0.73272 0.216888 1.55474
N  -2.013291 1.871961 -0.367263
N  -2.725061 1.601908 -1.464418
N  -4.076716 2.232262 0.212713
C  -0.224327 0.292572 0.257285
C  -1.503242 -1.631257 0.426424
C  -1.034002 -1.148263 1.793868
C  -3.00685 -1.561488 0.219981
C  -0.591446 1.668215 -0.309542
C  1.297626 0.146298 0.253745
C  -3.755158 -2.672604 0.945126
C  2.039389 -0.119618 -0.896041
C  2.005636 0.33496 1.437056
C  -5.25826 -2.578019 0.732159
C  3.422403 -0.221701 -0.867658
C  3.385618 0.240205 1.494994
C  -2.831798 2.233295 0.622284
C  4.082991 -0.044196 0.334871
C  -3.948307 1.833282 -1.067276
H  -1.148226 -2.646578 0.227273
H  -1.798035 -1.201737 2.568541
H  -0.150012 -1.693696 2.139698
H  -3.218047 -1.62714 -0.850684
H  -3.382751 -0.589344 0.554706
H  -0.191012 1.795299 -1.312342
H  -0.148618 2.441362 0.318043
H  -3.541335 -2.636631 2.017522
H  -3.394421 -3.644267 0.595696
H  1.470289 0.564416 2.34737
H  -5.653605 -1.63582 1.116035
H  -5.511822 -2.631901 -0.32819
H  -5.785885 -3.386756 1.238545
H  3.972095 -0.432667 -1.77428
H  3.90155 0.390645 2.43261
H  -2.483045 2.509395 1.604052
H  -4.788621 1.716502 -1.733319
elementType: Cl O N C H
totalener: -1817.03564131 hartree
nucrepener: 2164.18954701 hartree
electener: -3981.22518832 hartree
oneelecener: -6793.91619410 hartree
twoeener: 2812.69100578 hartree
cpcmener: -0.02831752 hartree
kineticenergy: 1811.92880951 hartree
xcener: -128.818561866320 hartree
chargesum: 0.0000000
charge: -0.075089 -0.084574 -0.374657 -0.396381 0.118876 -0.336555 -0.412945 0.588714 0.196354 -0.023698 -0.160073 -0.120171 -0.077924 -0.089950 -0.057240 -0.152068 -0.276081 -0.141060 -0.182468 0.061212 0.113256 0.050800 0.089141 0.110014 0.105860 0.070658 0.049737 0.135377 0.144943 0.059596 0.064776 0.153647 0.077308 0.080372 0.092934 0.121774 0.147965 0.167577 0.160042
qa: -0.0751 -0.0846 -0.3747 -0.3964 0.1189 -0.3366 -0.4129 0.5887 0.1964 -0.0237 -0.1601 -0.1202 -0.0779 -0.0899 -0.0572 -0.1521 -0.2761 -0.1411 -0.1825 0.0612 0.1133 0.0508 0.0891 0.1100 0.1059 0.0707 0.0497 0.1354 0.1449 0.0596 0.0648 0.1536 0.0773 0.0804 0.0929 0.1218 0.1480 0.1676 0.1600
va: 1.2441 1.2194 2.0192 1.9769 3.3882 2.8892 3.0127 3.8571 3.8972 3.9434 3.9583 3.8050 3.5918 3.8857 4.0459 3.9310 3.9379 4.0750 4.0438 4.0579 3.8562 4.0467 0.9980 1.0027 0.9988 1.0232 1.0130 1.0291 1.0049 1.0115 1.0100 1.0207 1.0033 1.0007 1.0037 1.0255 1.0059 1.0041 0.9983
dispcorr: -0.022185956 hartree
energy: -1817.057827263642
dipole: -39.46510 40.41060 0.94550 -11.38631 10.73920 -0.64711 13.36222 -11.62452 1.73769
magnitude: 2.08142 au
magnitude: 5.29055 debye
