program: Orca
programVersion: 4.2.1
elementType: Cl Cl O O N N N C C C C C C C C C C C C C C C H H H H H H H H H H H H H H H H H
charge: 0
multiplicity: 1
keywords: wb97x-d3
keywords: def2-TZVPP
keywords: def2/J RIJCOSX GRIDX6 NOFINALGRIDX
keywords: grid4 nofinalgrid
keywords: scfconv7
keywords: smallprint printgap noloewdin
keywords: NOSOSCF
formula: C15H17Cl2N3O2
InChI: InChI=1/C15H17Cl2N3O2/c1-2-3-12-7-21-15(22-12,8-20-10-18-9-19-20)13-5-4-11(16)6-14(13)17/h4-6,9-10,12H,2-3,7-8H2,1H3
39 atoms
Cl 1.666083 2.191095 1.134827
Cl 5.603556 -1.168436 -0.133813
O  -1.034055 -1.000209 -0.567661
O  -0.74402 0.519078 1.062668
N  -1.953688 1.651881 -1.192831
N  -2.931201 1.014426 -1.84131
N  -3.77412 2.652839 -0.567861
C  -0.301642 0.127484 -0.208004
C  -1.662072 -1.545133 0.588578
C  -1.82249 -0.311104 1.459654
C  -2.956021 -2.222897 0.194657
C  -0.583402 1.219438 -1.252194
C  1.193683 -0.17216 -0.163943
C  -3.705331 -2.783678 1.397793
C  2.129286 0.684285 0.414828
C  1.675966 -1.338119 -0.749636
C  -4.97767 -3.511075 0.993107
C  3.483572 0.38676 0.429766
C  3.022835 -1.660685 -0.74965
C  -2.470926 2.62008 -0.431683
C  3.917262 -0.791199 -0.152545
C  -4.001628 1.651453 -1.441777
H  -0.989288 -2.26731 1.070341
H  -2.784502 0.187433 1.287691
H  -1.730627 -0.521492 2.525352
H  -2.737173 -3.033351 -0.506963
H  -3.585471 -1.503342 -0.337842
H  -0.373162 0.841818 -2.252019
H  0.054004 2.086349 -1.088589
H  -3.95997 -1.975471 2.090487
H  -3.053909 -3.466168 1.95172
H  0.986075 -2.023362 -1.221517
H  -5.664334 -2.84741 0.464004
H  -4.761705 -4.353692 0.3334
H  -5.505746 -3.902454 1.863517
H  4.185992 1.067514 0.890441
H  3.359932 -2.578307 -1.211038
H  -1.867308 3.268236 0.184252
H  -4.985878 1.385127 -1.794966
elementType: Cl O N C H
totalener: -1817.04532365 hartree
nucrepener: 2150.67227265 hartree
electener: -3967.71759631 hartree
oneelecener: -6766.70585970 hartree
twoeener: 2798.98826339 hartree
cpcmener: -0.02312396 hartree
kineticenergy: 1811.90915636 hartree
xcener: -128.814657565524 hartree
chargesum: 0.0000000
charge: -0.074095 -0.082709 -0.390376 -0.378380 0.140878 -0.358577 -0.406109 0.585567 0.190550 -0.022927 -0.178110 -0.153024 -0.059001 -0.086021 -0.069466 -0.135192 -0.284525 -0.140091 -0.178172 0.063118 0.108973 0.062341 0.090747 0.085127 0.115710 0.079100 0.069238 0.131733 0.145614 0.064604 0.067207 0.151543 0.080304 0.081049 0.091907 0.122912 0.145934 0.161650 0.160969
qa: -0.0741 -0.0827 -0.3904 -0.3784 0.1409 -0.3586 -0.4061 0.5856 0.1905 -0.0229 -0.1781 -0.1530 -0.0590 -0.0860 -0.0695 -0.1352 -0.2845 -0.1401 -0.1782 0.0631 0.1090 0.0623 0.0907 0.0851 0.1157 0.0791 0.0692 0.1317 0.1456 0.0646 0.0672 0.1515 0.0803 0.0810 0.0919 0.1229 0.1459 0.1616 0.1610
va: 1.2456 1.2212 2.0102 1.9950 3.3545 2.8863 3.0294 3.8362 3.7973 3.9765 3.9678 3.8385 3.5947 3.8685 4.0544 3.9245 3.9517 4.0654 4.0449 4.0608 3.8681 4.0277 1.0028 0.9887 0.9948 1.0120 1.0170 1.0238 1.0148 1.0078 1.0077 1.0225 1.0003 1.0007 1.0028 1.0241 1.0069 1.0049 0.9965
dispcorr: -0.021687030 hartree
energy: -1817.067010681170
dipole: -40.77168 41.28839 0.51671 -19.43897 18.29685 -1.14213 2.58332 -2.21965 0.36367
magnitude: 1.30526 au
magnitude: 3.31770 debye
