program: Orca
programVersion: 4.2.1
elementType: Cl Cl O O N N N C C C C C C C C C C C C C C C H H H H H H H H H H H H H H H H H
charge: 0
multiplicity: 1
keywords: wb97x-d3
keywords: def2-TZVPP
keywords: def2/J RIJCOSX GRIDX6 NOFINALGRIDX
keywords: grid4 nofinalgrid
keywords: scfconv7
keywords: smallprint printgap noloewdin
keywords: NOSOSCF
formula: C15H17Cl2N3O2
InChI: InChI=1/C15H17Cl2N3O2/c1-2-3-12-7-21-15(22-12,8-20-10-18-9-19-20)13-5-4-11(16)6-14(13)17/h4-6,9-10,12H,2-3,7-8H2,1H3
39 atoms
Cl 0.924087 -1.682843 -1.975751
Cl 4.877315 1.391694 -0.157537
O  -1.064093 -1.798877 0.222969
O  -1.417389 -0.004153 1.493818
N  -1.417959 1.630027 -0.980281
N  -0.530607 2.080646 -1.869935
N  -1.305149 3.764725 -0.6159
C  -0.877981 -0.418336 0.275817
C  -1.192102 -2.313402 1.547844
C  -1.174499 -1.051218 2.41749
C  -2.444952 -3.165128 1.664135
C  -1.696653 0.223854 -0.851787
C  0.5973 -0.028021 0.176061
C  -3.762236 -2.460463 1.362245
C  1.453365 -0.523184 -0.805179
C  1.113096 0.930521 1.042795
C  -4.953254 -3.388918 1.551932
C  2.768454 -0.097119 -0.912564
C  2.421834 1.374304 0.960449
C  -1.866379 2.643786 -0.233606
C  3.241082 0.851698 -0.023347
C  -0.496391 3.363002 -1.617583
H  -0.322006 -2.937406 1.774153
H  -1.95513 -1.032138 3.178048
H  -0.209277 -0.923388 2.918546
H  -2.464798 -3.567105 2.68255
H  -2.338533 -4.032514 1.004965
H  -2.758136 0.081987 -0.646842
H  -1.471893 -0.248235 -1.805088
H  -3.757339 -2.087911 0.335171
H  -3.887024 -1.586596 2.007805
H  0.476702 1.355091 1.806547
H  -5.030695 -3.732941 2.585404
H  -5.891042 -2.890884 1.301701
H  -4.873314 -4.273957 0.917255
H  3.409839 -0.497034 -1.685692
H  2.787976 2.120054 1.652201
H  -2.592199 2.521495 0.554854
H  0.13031 4.037705 -2.180089
elementType: Cl O N C H
totalener: -1817.04330795 hartree
nucrepener: 2197.65487363 hartree
electener: -4014.69818158 hartree
oneelecener: -6861.03514604 hartree
twoeener: 2846.33696446 hartree
cpcmener: -0.02386858 hartree
kineticenergy: 1811.90529252 hartree
xcener: -128.814368361470 hartree
chargesum: 0.0000000
charge: -0.073894 -0.083976 -0.384589 -0.387044 0.114183 -0.333401 -0.403674 0.603630 0.173952 -0.041769 -0.167374 -0.123552 -0.100841 -0.071441 -0.038222 -0.139747 -0.286965 -0.141168 -0.196595 0.060594 0.121269 0.059476 0.088224 0.106267 0.107022 0.075290 0.075954 0.134636 0.134421 0.053727 0.062284 0.155690 0.081805 0.091132 0.080497 0.119668 0.145015 0.169566 0.159951
qa: -0.0739 -0.0840 -0.3846 -0.3870 0.1142 -0.3334 -0.4037 0.6036 0.1740 -0.0418 -0.1674 -0.1236 -0.1008 -0.0714 -0.0382 -0.1397 -0.2870 -0.1412 -0.1966 0.0606 0.1213 0.0595 0.0882 0.1063 0.1070 0.0753 0.0760 0.1346 0.1344 0.0537 0.0623 0.1557 0.0818 0.0911 0.0805 0.1197 0.1450 0.1696 0.1600
va: 1.2467 1.2199 2.0108 1.9625 3.3605 2.8818 3.0345 3.8134 3.8752 3.9537 3.9232 3.8732 3.6005 3.8633 4.0130 3.8549 3.9463 4.0879 4.0830 4.0690 3.8565 4.0445 1.0003 0.9984 0.9956 1.0097 1.0128 1.0110 1.0265 1.0191 1.0106 1.0164 1.0003 1.0032 1.0003 1.0257 1.0063 1.0043 0.9964
dispcorr: -0.022882315 hartree
energy: -1817.066190263645
dipole: -36.95541 35.93032 -1.02510 -16.15399 14.63949 -1.51450 18.31363 -16.50761 1.80602
magnitude: 2.57026 au
magnitude: 6.53308 debye
