program: Orca
programVersion: 4.2.1
elementType: Cl Cl O O N N N C C C C C C C C C C C C C C C H H H H H H H H H H H H H H H H H
charge: 0
multiplicity: 1
keywords: wb97x-d3
keywords: def2-TZVPP
keywords: def2/J RIJCOSX GRIDX6 NOFINALGRIDX
keywords: grid4 nofinalgrid
keywords: scfconv7
keywords: smallprint printgap noloewdin
keywords: NOSOSCF
formula: C15H17Cl2N3O2
InChI: InChI=1/C15H17Cl2N3O2/c1-2-3-12-7-21-15(22-12,8-20-10-18-9-19-20)13-5-4-11(16)6-14(13)17/h4-6,9-10,12H,2-3,7-8H2,1H3
39 atoms
Cl 1.13594 -0.388766 -2.42945
Cl 5.711006 -0.416553 0.301298
O  -0.970189 -0.606491 -0.410782
O  -0.767636 0.364266 1.587739
N  -1.99995 2.046173 -0.347605
N  -2.72793 1.796759 -1.437473
N  -4.030131 2.563631 0.213433
C  -0.285163 0.391451 0.280445
C  -1.633119 -1.474382 0.508184
C  -1.12424 -0.980337 1.859531
C  -3.140506 -1.36533 0.338026
C  -0.589128 1.775181 -0.304139
C  1.226619 0.158917 0.250158
C  -3.918534 -2.446833 1.084574
C  1.927655 -0.191347 -0.902621
C  1.969339 0.351411 1.411624
C  -3.778074 -3.83917 0.484315
C  3.302942 -0.373563 -0.894865
C  3.342444 0.178952 1.447709
C  -2.789338 2.497205 0.630945
C  3.998219 -0.190448 0.287119
C  -3.9354 2.125028 -1.057709
H  -1.295926 -2.496213 0.315487
H  -1.879884 -0.984515 2.644827
H  -0.260701 -1.556455 2.208228
H  -3.381174 -1.418424 -0.727358
H  -3.467854 -0.379453 0.681846
H  -0.198449 1.862702 -1.315158
H  -0.098394 2.534758 0.303932
H  -4.974699 -2.16774 1.084824
H  -3.621426 -2.46836 2.138087
H  1.466519 0.646407 2.322136
H  -2.751778 -4.208315 0.516907
H  -4.394043 -4.5606 1.023061
H  -4.097937 -3.851546 -0.559461
H  3.820441 -0.651061 -1.802707
H  3.885453 0.334401 2.369478
H  -2.420683 2.771878 1.605914
H  -4.782045 2.04754 -1.722065
elementType: Cl O N C H
totalener: -1817.04329217 hartree
nucrepener: 2165.58138435 hartree
electener: -3982.62467651 hartree
oneelecener: -6796.64726570 hartree
twoeener: 2814.02258919 hartree
cpcmener: -0.02483824 hartree
kineticenergy: 1811.91120268 hartree
xcener: -128.815744739949 hartree
chargesum: -0.0000000
charge: -0.071299 -0.082759 -0.366856 -0.388407 0.119055 -0.332076 -0.408846 0.580813 0.171132 -0.021803 -0.162647 -0.116789 -0.081791 -0.106253 -0.054115 -0.156839 -0.269380 -0.142370 -0.179988 0.055387 0.112526 0.052789 0.094080 0.107562 0.103594 0.072213 0.071454 0.134228 0.141823 0.074751 0.055983 0.151949 0.076100 0.092103 0.081136 0.121207 0.145814 0.167956 0.158563
qa: -0.0713 -0.0828 -0.3669 -0.3884 0.1191 -0.3321 -0.4088 0.5808 0.1711 -0.0218 -0.1626 -0.1168 -0.0818 -0.1063 -0.0541 -0.1568 -0.2694 -0.1424 -0.1800 0.0554 0.1125 0.0528 0.0941 0.1076 0.1036 0.0722 0.0715 0.1342 0.1418 0.0748 0.0560 0.1519 0.0761 0.0921 0.0811 0.1212 0.1458 0.1680 0.1586
va: 1.2473 1.2213 2.0232 1.9850 3.3867 2.8841 3.0148 3.8798 3.8663 3.9384 3.9364 3.8052 3.5849 3.9096 4.0478 3.9366 3.9305 4.0732 4.0429 4.0585 3.8628 4.0437 0.9986 1.0041 0.9991 1.0224 1.0173 1.0290 1.0059 1.0052 1.0127 1.0217 1.0029 1.0037 1.0015 1.0259 1.0067 1.0029 0.9980
dispcorr: -0.022189459 hartree
energy: -1817.065481623670
dipole: -35.89575 36.75577 0.86003 -12.61145 11.96809 -0.64336 13.35778 -11.69328 1.66451
magnitude: 1.98094 au
magnitude: 5.03516 debye
