program: Orca
programVersion: 4.2.1
elementType: Cl Cl O O N N N C C C C C C C C C C C C C C C H H H H H H H H H H H H H H H H H
charge: 0
multiplicity: 1
keywords: wb97x-d3
keywords: def2-TZVPP
keywords: def2/J RIJCOSX GRIDX6 NOFINALGRIDX
keywords: grid4 nofinalgrid
keywords: scfconv7
keywords: smallprint printgap noloewdin
keywords: NOSOSCF
formula: C15H17Cl2N3O2
InChI: InChI=1/C15H17Cl2N3O2/c1-2-3-12-7-21-15(22-12,8-20-10-18-9-19-20)13-5-4-11(16)6-14(13)17/h4-6,9-10,12H,2-3,7-8H2,1H3
39 atoms
Cl 1.18175 -0.472928 -2.425937
Cl 5.737008 -0.406598 0.336445
O  -0.951832 -0.581078 -0.39886
O  -0.715185 0.510552 1.548795
N  -1.958811 2.088891 -0.401932
N  -2.826446 1.661673 -1.321772
N  -3.89883 2.72724 0.328678
C  -0.251333 0.441749 0.226156
C  -1.501771 -1.440881 0.590171
C  -1.700724 -0.487318 1.758462
C  -2.77372 -2.068002 0.060949
C  -0.556735 1.777695 -0.470227
C  1.256909 0.198458 0.228388
C  -3.455745 -2.966912 1.086017
C  1.964009 -0.203767 -0.903863
C  1.991438 0.424129 1.389152
C  -4.72491 -3.599538 0.535644
C  3.337548 -0.39739 -0.878155
C  3.363354 0.246241 1.440686
C  -2.612566 2.717394 0.579168
C  4.025748 -0.17061 0.300233
C  -3.974053 2.06889 -0.845238
H  -0.775753 -2.222009 0.853416
H  -2.702308 -0.0412 1.752881
H  -1.535872 -0.955725 2.729052
H  -2.539917 -2.650925 -0.834329
H  -3.456309 -1.270026 -0.24824
H  -0.255996 1.75705 -1.51481
H  0.000482 2.573538 0.021871
H  -3.703979 -2.391548 1.983183
H  -2.763856 -3.75104 1.406875
H  1.484679 0.74895 2.286209
H  -4.515004 -4.212278 -0.343106
H  -5.204049 -4.240468 1.276664
H  -5.450593 -2.83912 0.240685
H  3.858804 -0.718426 -1.769279
H  3.899694 0.432053 2.360642
H  -2.115365 3.151189 1.431837
H  -4.902142 1.889143 -1.365296
elementType: Cl O N C H
totalener: -1817.04496177 hartree
nucrepener: 2151.78496729 hartree
electener: -3968.82992905 hartree
oneelecener: -6769.04667972 hartree
twoeener: 2800.21675066 hartree
cpcmener: -0.02403268 hartree
kineticenergy: 1811.91166825 hartree
xcener: -128.814906202660 hartree
chargesum: -0.0000000
charge: -0.073106 -0.082862 -0.355607 -0.408907 0.131939 -0.352902 -0.407747 0.550061 0.187611 -0.030764 -0.160653 -0.113764 -0.065469 -0.086608 -0.020456 -0.154655 -0.285979 -0.149354 -0.175747 0.049011 0.111874 0.058221 0.086368 0.088853 0.116730 0.077889 0.063698 0.133766 0.134891 0.063700 0.067222 0.148575 0.081443 0.092186 0.081210 0.121862 0.145364 0.171327 0.160778
qa: -0.0731 -0.0829 -0.3556 -0.4089 0.1319 -0.3529 -0.4077 0.5501 0.1876 -0.0308 -0.1607 -0.1138 -0.0655 -0.0866 -0.0205 -0.1547 -0.2860 -0.1494 -0.1757 0.0490 0.1119 0.0582 0.0864 0.0889 0.1167 0.0779 0.0637 0.1338 0.1349 0.0637 0.0672 0.1486 0.0814 0.0922 0.0812 0.1219 0.1454 0.1713 0.1608
va: 1.2451 1.2212 2.0236 1.9627 3.3827 2.8881 3.0233 3.8977 3.8285 3.9554 3.9584 3.8301 3.6063 3.8712 4.0064 3.9639 3.9495 4.0798 4.0397 4.0590 3.8612 4.0354 1.0057 0.9912 0.9963 1.0131 1.0156 1.0291 1.0063 1.0079 1.0080 1.0269 1.0005 1.0032 1.0003 1.0257 1.0066 1.0006 0.9961
dispcorr: -0.021528544 hartree
energy: -1817.066490312166
dipole: -38.08714 38.80300 0.71586 -12.69252 12.16071 -0.53181 12.58903 -11.19693 1.39210
magnitude: 1.65324 au
magnitude: 4.20220 debye
