program: Orca
programVersion: 4.2.1
elementType: Cl Cl O O N N N C C C C C C C C C C C C C C C H H H H H H H H H H H H H H H H H
charge: 0
multiplicity: 1
keywords: wb97x-d3
keywords: def2-TZVPP
keywords: def2/J RIJCOSX GRIDX6 NOFINALGRIDX
keywords: grid4 nofinalgrid
keywords: scfconv7
keywords: smallprint printgap noloewdin
keywords: NOSOSCF
formula: C15H17Cl2N3O2
InChI: InChI=1/C15H17Cl2N3O2/c1-2-3-12-7-21-15(22-12,8-20-10-18-9-19-20)13-5-4-11(16)6-14(13)17/h4-6,9-10,12H,2-3,7-8H2,1H3
39 atoms
Cl 1.742922 2.035086 1.755797
Cl 4.394111 -0.63683 -2.015693
O  -1.670004 -0.717936 0.713414
O  -0.655466 0.404022 2.34305
N  -1.465339 1.707614 -0.966818
N  -0.510672 2.345636 -1.647381
N  -1.950705 1.364639 -3.052151
C  -0.78619 0.329681 0.955646
C  -1.420731 -1.71419 1.701758
C  -0.88133 -0.889769 2.878812
C  -2.690832 -2.478138 2.002029
C  -1.434791 1.631119 0.469993
C  0.552107 0.079261 0.259161
C  -3.231986 -3.270903 0.818621
C  1.71014 0.799383 0.542317
C  0.624194 -0.859403 -0.765588
C  -4.480788 -4.060133 1.180817
C  2.894064 0.584297 -0.146665
C  1.79124 -1.09586 -1.47151
C  -2.313102 1.120428 -1.81645
C  2.921891 -0.367229 -1.150629
C  -0.843253 2.116633 -2.891038
H  -0.650491 -2.408313 1.341594
H  -1.604059 -0.806341 3.694502
H  0.042422 -1.313775 3.279542
H  -3.451061 -1.78225 2.372544
H  -2.471741 -3.163358 2.827082
H  -0.885416 2.494254 0.838508
H  -2.452456 1.687631 0.857049
H  -2.458584 -3.95476 0.455788
H  -3.456789 -2.594543 -0.009947
H  -0.256911 -1.426789 -1.031017
H  -5.288473 -3.400371 1.504306
H  -4.849589 -4.635719 0.330853
H  -4.286089 -4.762894 1.99356
H  3.777995 1.157767 0.095506
H  1.809257 -1.835483 -2.25976
H  -3.167325 0.546377 -1.493795
H  -0.268372 2.510676 -3.714793
elementType: Cl O N C H
totalener: -1817.04467879 hartree
nucrepener: 2188.84154380 hartree
electener: -4005.88622259 hartree
oneelecener: -6843.29910919 hartree
twoeener: 2837.41288660 hartree
cpcmener: -0.02354693 hartree
kineticenergy: 1811.91087733 hartree
xcener: -128.813658576037 hartree
chargesum: 0.0000000
charge: -0.073896 -0.084020 -0.377540 -0.364656 0.112423 -0.336933 -0.404757 0.582995 0.101791 0.041089 -0.170216 -0.093247 -0.102541 -0.063393 -0.038276 -0.144342 -0.284716 -0.140763 -0.194133 0.058663 0.120298 0.061654 0.092992 0.087868 0.086551 0.064878 0.078764 0.131198 0.129395 0.056555 0.064302 0.155216 0.079896 0.091870 0.079911 0.119454 0.144574 0.170052 0.161040
qa: -0.0739 -0.0840 -0.3775 -0.3647 0.1124 -0.3369 -0.4048 0.5830 0.1018 0.0411 -0.1702 -0.0932 -0.1025 -0.0634 -0.0383 -0.1443 -0.2847 -0.1408 -0.1941 0.0587 0.1203 0.0617 0.0930 0.0879 0.0866 0.0649 0.0788 0.1312 0.1294 0.0566 0.0643 0.1552 0.0799 0.0919 0.0799 0.1195 0.1446 0.1701 0.1610
va: 1.2464 1.2198 1.9979 2.0098 3.3598 2.8779 3.0344 3.8583 3.8789 3.9555 3.9559 3.8312 3.5601 3.8399 4.0118 3.8770 3.9470 4.0855 4.0844 4.0726 3.8551 4.0417 0.9952 0.9963 0.9969 1.0175 1.0100 1.0266 1.0225 1.0109 1.0161 1.0107 1.0002 1.0039 1.0002 1.0259 1.0062 1.0012 0.9957
dispcorr: -0.022242537 hartree
energy: -1817.066921331176
dipole: -36.51903 35.48542 -1.03361 -24.05842 22.41348 -1.64494 10.66889 -9.04886 1.62003
magnitude: 2.52957 au
magnitude: 6.42964 debye
