program: Orca
programVersion: 4.2.1
elementType: Cl Cl O O N N N C C C C C C C C C C C C C C C H H H H H H H H H H H H H H H H H
charge: 0
multiplicity: 1
keywords: wb97x-d3
keywords: def2-TZVPP
keywords: def2/J RIJCOSX GRIDX6 NOFINALGRIDX
keywords: grid4 nofinalgrid
keywords: scfconv7
keywords: smallprint printgap noloewdin
keywords: NOSOSCF
formula: C15H17Cl2N3O2
InChI: InChI=1/C15H17Cl2N3O2/c1-2-3-12-7-21-15(22-12,8-20-10-18-9-19-20)13-5-4-11(16)6-14(13)17/h4-6,9-10,12H,2-3,7-8H2,1H3
39 atoms
Cl 0.689091 -1.779859 -1.798695
Cl 4.912396 1.229075 -0.572708
O  -1.060099 -1.658062 0.577735
O  -1.259664 0.261213 1.722013
N  -1.40381 1.693595 -0.861015
N  -0.584265 2.028226 -1.860427
N  -1.117808 3.833218 -0.648994
C  -0.843696 -0.278647 0.503861
C  -1.495437 -2.012297 1.89053
C  -1.144851 -0.767387 2.691798
C  -2.974905 -2.356531 1.904476
C  -1.731178 0.315127 -0.601167
C  0.62831 0.035665 0.245537
C  -3.346331 -3.498047 0.966817
C  1.370816 -0.567062 -0.767458
C  1.258848 1.02777 0.989275
C  -4.835644 -3.805635 0.989616
C  2.687021 -0.213472 -1.021149
C  2.570759 1.404871 0.756543
C  -1.705735 2.777719 -0.140195
C  3.275481 0.775226 -0.252603
C  -0.44413 3.317788 -1.69709
H  -0.909218 -2.875185 2.21889
H  -1.839898 -0.557898 3.504699
H  -0.130774 -0.81735 3.10328
H  -3.565683 -1.465199 1.662612
H  -3.240057 -2.628998 2.931458
H  -2.77756 0.237531 -0.30305
H  -1.605272 -0.234214 -1.530523
H  -2.783298 -4.39425 1.246251
H  -3.043234 -3.251355 -0.053444
H  0.715158 1.534316 1.77423
H  -5.080224 -4.636291 0.325748
H  -5.175836 -4.076526 1.991308
H  -5.423967 -2.944627 0.665362
H  3.23967 -0.699123 -1.813423
H  3.026104 2.182835 1.353442
H  -2.351205 2.752184 0.72364
H  0.162821 3.912256 -2.362408
elementType: Cl O N C H
totalener: -1817.04354817 hartree
nucrepener: 2191.71192973 hartree
electener: -4008.75547790 hartree
oneelecener: -6849.23349843 hartree
twoeener: 2840.47802053 hartree
cpcmener: -0.02359009 hartree
kineticenergy: 1811.91018322 hartree
xcener: -128.813356577231 hartree
chargesum: 0.0000000
charge: -0.074329 -0.084882 -0.372671 -0.385345 0.114173 -0.332029 -0.403116 0.587152 0.210062 -0.024849 -0.215188 -0.120378 -0.093801 -0.072661 -0.052405 -0.129724 -0.281909 -0.136418 -0.192683 0.057502 0.117758 0.059597 0.094300 0.104397 0.100461 0.074702 0.079738 0.130472 0.128969 0.059396 0.061143 0.151399 0.091633 0.077592 0.079699 0.119301 0.144953 0.168656 0.159333
qa: -0.0743 -0.0849 -0.3727 -0.3853 0.1142 -0.3320 -0.4031 0.5872 0.2101 -0.0248 -0.2152 -0.1204 -0.0938 -0.0727 -0.0524 -0.1297 -0.2819 -0.1364 -0.1927 0.0575 0.1178 0.0596 0.0943 0.1044 0.1005 0.0747 0.0797 0.1305 0.1290 0.0594 0.0611 0.1514 0.0916 0.0776 0.0797 0.1193 0.1450 0.1687 0.1593
va: 1.2457 1.2193 2.0251 1.9759 3.3598 2.8816 3.0325 3.8344 3.8583 4.0044 3.9323 3.8726 3.6022 3.8502 4.0306 3.8436 3.9477 4.0826 4.0797 4.0711 3.8584 4.0446 0.9943 0.9980 0.9960 1.0069 1.0131 1.0113 1.0276 1.0074 1.0234 1.0199 1.0035 1.0011 1.0006 1.0249 1.0064 1.0056 0.9966
dispcorr: -0.022501004 hartree
energy: -1817.066049175324
dipole: -36.68644 35.47452 -1.21192 -16.07805 14.71177 -1.36627 17.73456 -15.75787 1.97668
magnitude: 2.69123 au
magnitude: 6.84057 debye
